14 Replies Latest reply on Jun 30, 2009 10:57 AM by AntoineSolutions

    vmware-tools does not work in fedora11

    bigfeetliu Lurker

       

      I installed fedora11 with vmware fusion 2.0.4

       

       

      but vmware-tools seem do not work, at least no shared-folders appear under /mnt/hgfs!!!!

       

       

      I rechecked vmware-tools install procedures. it reported errors while run vmware-config-tools.pl:

       

      -


       

      Using 2.6.x kernel build system.

      make: Entering directory `/tmp/vmware-config5/vmmemctl-only'

      make -C /lib/modules/2.6.29.4-167.fc11.i686.PAE/build/include/.. SUBDIRS=$PWD SRCROOT=$PWD/. modules

      make[1]: Entering directory `/usr/src/kernels/2.6.29.4-167.fc11.i686.PAE'

        CC   /tmp/vmware-config5/vmmemctl-only/backdoorGcc32.o

      In file included from /tmp/vmware-config5/vmmemctl-only/backdoor.h:29,

                       from /tmp/vmware-config5/vmmemctl-only/backdoorGcc32.c:45:

      /tmp/vmware-config5/vmmemctl-only/vm_basic_types.h:108:7: warning: "__FreeBSD__" is not defined

        CC   /tmp/vmware-config5/vmmemctl-only/os.o

      In file included from /tmp/vmware-config5/vmmemctl-only/os.c:51:

      /tmp/vmware-config5/vmmemctl-only/compat_wait.h:78: error: conflicting types for ‘poll_initwait’

      include/linux/poll.h:67: note: previous declaration of ‘poll_initwait’ was here

      make[2]: *** /tmp/vmware-config5/vmmemctl-only/os.o Error 1

      make[1]: *** Error 2

      make[1]: Leaving directory `/usr/src/kernels/2.6.29.4-167.fc11.i686.PAE'

      make: *** http://vmmemctl.ko Error 2

      make: Leaving directory `/tmp/vmware-config5/vmmemctl-only'

      Unable to build the vmmemctl module.

       

      -


      Building the vmhgfs module.

       

      Using 2.6.x kernel build system.

      make: Entering directory `/tmp/vmware-config6/vmhgfs-only'

      make -C /lib/modules/2.6.29.4-167.fc11.i686.PAE/build/include/.. SUBDIRS=$PWD SRCROOT=$PWD/. modules

      make[1]: Entering directory `/usr/src/kernels/2.6.29.4-167.fc11.i686.PAE'

        CC   /tmp/vmware-config6/vmhgfs-only/backdoor.o

      In file included from /tmp/vmware-config6/vmhgfs-only/backdoor.h:29,

                       from /tmp/vmware-config6/vmhgfs-only/backdoor.c:40:

      /tmp/vmware-config6/vmhgfs-only/vm_basic_types.h:108:7: warning: "__FreeBSD__" is not defined

        CC   /tmp/vmware-config6/vmhgfs-only/backdoorGcc32.o

      In file included from /tmp/vmware-config6/vmhgfs-only/backdoor.h:29,

                       from /tmp/vmware-config6/vmhgfs-only/backdoorGcc32.c:45:

      /tmp/vmware-config6/vmhgfs-only/vm_basic_types.h:108:7: warning: "__FreeBSD__" is not defined

        CC   /tmp/vmware-config6/vmhgfs-only/bdhandler.o

      In file included from /tmp/vmware-config6/vmhgfs-only/rpcout.h:30,

                       from /tmp/vmware-config6/vmhgfs-only/hgfsBd.h:28,

                       from /tmp/vmware-config6/vmhgfs-only/bdhandler.c:45:

      /tmp/vmware-config6/vmhgfs-only/vm_basic_types.h:108:7: warning: "__FreeBSD__" is not defined

      In file included from /tmp/vmware-config6/vmhgfs-only/request.h:35,

                       from /tmp/vmware-config6/vmhgfs-only/bdhandler.c:50:

      /tmp/vmware-config6/vmhgfs-only/compat_wait.h:78: error: conflicting types for ‘poll_initwait’

      include/linux/poll.h:67: note: previous declaration of ‘poll_initwait’ was here

      make[2]: *** /tmp/vmware-config6/vmhgfs-only/bdhandler.o Error 1

      make[1]: *** Error 2

      make[1]: Leaving directory `/usr/src/kernels/2.6.29.4-167.fc11.i686.PAE'

      make: *** http://vmhgfs.ko Error 2

      make: Leaving directory `/tmp/vmware-config6/vmhgfs-only'

      Unable to build the vmhgfs module.

       

      -


      Building the vmxnet module.

       

      Using 2.6.x kernel build system.

      make: Entering directory `/tmp/vmware-config7/vmxnet-only'

      make -C /lib/modules/2.6.29.4-167.fc11.i686.PAE/build/include/.. SUBDIRS=$PWD SRCROOT=$PWD/. modules

      make[1]: Entering directory `/usr/src/kernels/2.6.29.4-167.fc11.i686.PAE'

        CC   /tmp/vmware-config7/vmxnet-only/vmxnet.o

      In file included from /tmp/vmware-config7/vmxnet-only/vmxnet.c:48:

      /tmp/vmware-config7/vmxnet-only/vm_basic_types.h:108:7: warning: "__FreeBSD__" is not defined

      /tmp/vmware-config7/vmxnet-only/vmxnet.c: In function ‘vmxnet_change_mtu’:

      /tmp/vmware-config7/vmxnet-only/vmxnet.c:193: error: ‘struct net_device’ has no member named ‘priv’

      /tmp/vmware-config7/vmxnet-only/vmxnet.c: In function ‘vmxnet_get_drvinfo’:

      /tmp/vmware-config7/vmxnet-only/vmxnet.c:267: error: ‘struct net_device’ has no member named ‘priv’

      /tmp/vmware-config7/vmxnet-only/vmxnet.c: In function ‘vmxnet_set_tso’:

      /tmp/vmware-config7/vmxnet-only/vmxnet.c:305: error: ‘struct net_device’ has no member named ‘priv’

      /tmp/vmware-config7/vmxnet-only/vmxnet.c: In function ‘vmxnet_link_check’:

      /tmp/vmware-config7/vmxnet-only/vmxnet.c:659: error: ‘struct net_device’ has no member named ‘priv’

      /tmp/vmware-config7/vmxnet-only/vmxnet.c: In function ‘vmxnet_probe_device’:

      /tmp/vmware-config7/vmxnet-only/vmxnet.c:841: error: ‘struct net_device’ has no member named ‘priv’

      /tmp/vmware-config7/vmxnet-only/vmxnet.c: In function ‘vmxnet_remove_device’:

      /tmp/vmware-config7/vmxnet-only/vmxnet.c:1142: error: ‘struct net_device’ has no member named ‘priv’

      /tmp/vmware-config7/vmxnet-only/vmxnet.c: In function ‘vmxnet_init_ring’:

      /tmp/vmware-config7/vmxnet-only/vmxnet.c:1213: error: ‘struct net_device’ has no member named ‘priv’

      /tmp/vmware-config7/vmxnet-only/vmxnet.c: In function ‘vmxnet_open’:

      /tmp/vmware-config7/vmxnet-only/vmxnet.c:1338: error: ‘struct net_device’ has no member named ‘priv’

      /tmp/vmware-config7/vmxnet-only/vmxnet.c: In function ‘check_tx_queue’:

      /tmp/vmware-config7/vmxnet-only/vmxnet.c:1594: error: ‘struct net_device’ has no member named ‘priv’

      /tmp/vmware-config7/vmxnet-only/vmxnet.c: In function ‘vmxnet_tx’:

      /tmp/vmware-config7/vmxnet-only/vmxnet.c:1658: error: ‘struct net_device’ has no member named ‘priv’

      /tmp/vmware-config7/vmxnet-only/vmxnet.c: In function ‘vmxnet_rx’:

      /tmp/vmware-config7/vmxnet-only/vmxnet.c:2057: error: ‘struct net_device’ has no member named ‘priv’

      /tmp/vmware-config7/vmxnet-only/vmxnet.c: In function ‘vmxnet_interrupt’:

      /tmp/vmware-config7/vmxnet-only/vmxnet.c:2232: error: ‘struct net_device’ has no member named ‘priv’

      /tmp/vmware-config7/vmxnet-only/vmxnet.c: In function ‘vmxnet_close’:

      /tmp/vmware-config7/vmxnet-only/vmxnet.c:2314: error: ‘struct net_device’ has no member named ‘priv’

      /tmp/vmware-config7/vmxnet-only/vmxnet.c: In function ‘vmxnet_load_multicast’:

      /tmp/vmware-config7/vmxnet-only/vmxnet.c:2404: error: ‘struct net_device’ has no member named ‘priv’

      /tmp/vmware-config7/vmxnet-only/vmxnet.c: In function ‘vmxnet_set_multicast_list’:

      /tmp/vmware-config7/vmxnet-only/vmxnet.c:2465: error: ‘struct net_device’ has no member named ‘priv’

      /tmp/vmware-config7/vmxnet-only/vmxnet.c: In function ‘vmxnet_get_stats’:

      /tmp/vmware-config7/vmxnet-only/vmxnet.c:2545: error: ‘struct net_device’ has no member named ‘priv’

      make[2]: *** /tmp/vmware-config7/vmxnet-only/vmxnet.o Error 1

      make[1]: *** Error 2

      make[1]: Leaving directory `/usr/src/kernels/2.6.29.4-167.fc11.i686.PAE'

      make: *** http://vmxnet.ko Error 2

      make: Leaving directory `/tmp/vmware-config7/vmxnet-only'

      Unable to build the vmxnet module.

      -


      Building the vmblock module.

       

      Using 2.6.x kernel build system.

      make: Entering directory `/tmp/vmware-config8/vmblock-only'

      make -C /lib/modules/2.6.29.4-167.fc11.i686.PAE/build/include/.. SUBDIRS=$PWD SRCROOT=$PWD/. modules

      make[1]: Entering directory `/usr/src/kernels/2.6.29.4-167.fc11.i686.PAE'

        CC   /tmp/vmware-config8/vmblock-only/linux/block.o

      In file included from /tmp/vmware-config8/vmblock-only/linux/os.h:35,

                       from /tmp/vmware-config8/vmblock-only/linux/block.c:26:

      /tmp/vmware-config8/vmblock-only/./include/compat_wait.h:78: error: conflicting types for ‘poll_initwait’

      include/linux/poll.h:67: note: previous declaration of ‘poll_initwait’ was here

      In file included from /tmp/vmware-config8/vmblock-only/linux/vmblockInt.h:40,

                       from /tmp/vmware-config8/vmblock-only/linux/block.c:29:

      /tmp/vmware-config8/vmblock-only/./include/vm_basic_types.h:108:7: warning: "__FreeBSD__" is not defined

      make[2]: *** /tmp/vmware-config8/vmblock-only/linux/block.o Error 1

      make[1]: *** Error 2

      make[1]: Leaving directory `/usr/src/kernels/2.6.29.4-167.fc11.i686.PAE'

      make: *** http://vmblock.ko Error 2

      make: Leaving directory `/tmp/vmware-config8/vmblock-only'

      Unable to build the vmblock module.

       

       

       

      -


      Building the vmci module.

       

      Using 2.6.x kernel build system.

      make: Entering directory `/tmp/vmware-config9/vmci-only'

      make -C /lib/modules/2.6.29.4-167.fc11.i686.PAE/build/include/.. SUBDIRS=$PWD SRCROOT=$PWD/. modules

      make[1]: Entering directory `/usr/src/kernels/2.6.29.4-167.fc11.i686.PAE'

        CC   /tmp/vmware-config9/vmci-only/kernelStubsLinux.o

      In file included from /tmp/vmware-config9/vmci-only/kernelStubs.h:35,

                       from /tmp/vmware-config9/vmci-only/kernelStubsLinux.c:28:

      /tmp/vmware-config9/vmci-only/vm_basic_types.h:108:7: warning: "__FreeBSD__" is not defined

        CC   /tmp/vmware-config9/vmci-only/vmciDatagram.o

      In file included from /tmp/vmware-config9/vmci-only/vmciDatagram.c:42:

      /tmp/vmware-config9/vmci-only/vm_basic_types.h:108:7: warning: "__FreeBSD__" is not defined

      In file included from /tmp/vmware-config9/vmci-only/vmci_kernel_if.h:41,

                       from /tmp/vmware-config9/vmci-only/vmciDatagram.c:45:

      /tmp/vmware-config9/vmci-only/compat_wait.h:78: error: conflicting types for ‘poll_initwait’

      include/linux/poll.h:67: note: previous declaration of ‘poll_initwait’ was here

      In file included from /tmp/vmware-config9/vmci-only/vmci_queue_pair.h:36,

                       from /tmp/vmware-config9/vmci-only/vmciGuestKernelAPI.h:43,

                       from /tmp/vmware-config9/vmci-only/vmciUtil.h:33,

                       from /tmp/vmware-config9/vmci-only/vmciDatagram.c:48:

      /tmp/vmware-config9/vmci-only/vm_atomic.h:329:7: warning: "_MSC_VER" is not defined

      /tmp/vmware-config9/vmci-only/vm_atomic.h:333:7: warning: "_MSC_VER" is not defined

      /tmp/vmware-config9/vmci-only/vm_atomic.h:401:7: warning: "_MSC_VER" is not defined

      /tmp/vmware-config9/vmci-only/vm_atomic.h:407:7: warning: "_MSC_VER" is not defined

      /tmp/vmware-config9/vmci-only/vm_atomic.h:506:7: warning: "_MSC_VER" is not defined

      /tmp/vmware-config9/vmci-only/vm_atomic.h:595:7: warning: "_MSC_VER" is not defined

      /tmp/vmware-config9/vmci-only/vm_atomic.h:684:7: warning: "_MSC_VER" is not defined

      /tmp/vmware-config9/vmci-only/vm_atomic.h:773:7: warning: "_MSC_VER" is not defined

      /tmp/vmware-config9/vmci-only/vm_atomic.h:775:7: warning: "_MSC_VER" is not defined

      /tmp/vmware-config9/vmci-only/vm_atomic.h:860:7: warning: "_MSC_VER" is not defined

      /tmp/vmware-config9/vmci-only/vm_atomic.h:862:7: warning: "_MSC_VER" is not defined

      /tmp/vmware-config9/vmci-only/vm_atomic.h:945:7: warning: "_MSC_VER" is not defined

      /tmp/vmware-config9/vmci-only/vm_atomic.h:947:7: warning: "_MSC_VER" is not defined

      /tmp/vmware-config9/vmci-only/vm_atomic.h:1028:7: warning: "_MSC_VER" is not defined

      /tmp/vmware-config9/vmci-only/vm_atomic.h:1030:7: warning: "_MSC_VER" is not defined

      /tmp/vmware-config9/vmci-only/vm_atomic.h:1223:7: warning: "_MSC_VER" is not defined

      /tmp/vmware-config9/vmci-only/vm_atomic.h:1227:7: warning: "_MSC_VER" is not defined

      /tmp/vmware-config9/vmci-only/vm_atomic.h:1536:7: warning: "_MSC_VER" is not defined

      /tmp/vmware-config9/vmci-only/vm_atomic.h:1663:7: warning: "_MSC_VER" is not defined

      make[2]: *** /tmp/vmware-config9/vmci-only/vmciDatagram.o Error 1

      make[1]: *** Error 2

      make[1]: Leaving directory `/usr/src/kernels/2.6.29.4-167.fc11.i686.PAE'

      make: *** http://vmci.ko Error 2

      make: Leaving directory `/tmp/vmware-config9/vmci-only'

      Unable to build the vmci module. 

      -