TaKeN3
Enthusiast
Enthusiast

Upgrade from 6.0 to 6.5 - Many issue!!!!

Helllo Guys,

I just upgrade my little server from VMWare 6.0 to 6.5 and i saw in dmesg amazing many failed/errors:

I don`t have support this is free license but will be good if someone from VMWare check this and repair i don`t want get some much errors on my prodution where i got it support ofc....

This is dmesg from my server:

[root@esx01:~] dmesg |grep -i fail

TSC: 120750 cpu0:1)BootConfig: 82: reliableMemPsodOnAllocFailure = FALSE

0:00:00:00.000 cpu0:1)WARNING: Serial: 820: Serial port com2 failed during initialization: Failure

0:00:00:04.726 cpu0:65536)WARNING: Serial: 274: logPort initialization failed

0:00:00:04.726 cpu0:65536)WARNING: Serial: 283: gdbPort initialization failed

0:00:00:04.726 cpu0:65536)WARNING: Serial: 300: shellPort initialization failed

0:00:00:04.726 cpu0:65536)WARNING: Serial: 317: consolePort initialization failed

2017-03-29T21:22:39.160Z cpu0:65887)Jumpstart plugin iodm activation failed: iodm->start() failed: error while executing the cli

2017-03-29T21:22:42.184Z cpu6:66034)WARNING: VMKAPICore: 2423: Failed to register external keyboard driver, type: 1

2017-03-29T21:22:42.194Z cpu6:66034)WARNING: Mod: 1690: <mlx_compat>: Export of <memmove>@<com.mellanox.compat> failed: already exported in name-space <vmkernel> by <vmkernel>

2017-03-29T21:22:42.194Z cpu6:66034)WARNING: Elf: 1908: Module <mlx_compat> - failed to finalize symbols

2017-03-29T21:22:42.194Z cpu6:66034)WARNING: Elf: 3017: Kernel based module load of mlx_compat failed: Already exists <ElfExportSymbols failed>

2017-03-29T21:22:42.768Z cpu6:66034)WARNING: Elf: 2219: Load of <mlx4_core> failed : missing required namespace <com.mellanox.compat#9.2.3.0>

2017-03-29T21:22:42.769Z cpu6:66034)WARNING: Elf: 3017: Kernel based module load of mlx4_core failed: Invalid or missing namespace <ElfSetNamespaceInfo failed>

2017-03-29T21:22:43.588Z cpu6:66034)WARNING: Mod: 1690: <mlx_compat>: Export of <memmove>@<com.mellanox.compat> failed: already exported in name-space <vmkernel> by <vmkernel>

2017-03-29T21:22:43.588Z cpu6:66034)WARNING: Elf: 1908: Module <mlx_compat> - failed to finalize symbols

2017-03-29T21:22:43.588Z cpu6:66034)WARNING: Elf: 3017: Kernel based module load of mlx_compat failed: Already exists <ElfExportSymbols failed>

2017-03-29T21:22:44.400Z cpu6:66034)WARNING: Elf: 2219: Load of <mlx4_core> failed : missing required namespace <com.mellanox.compat#9.2.3.0>

2017-03-29T21:22:44.401Z cpu6:66034)WARNING: Elf: 3017: Kernel based module load of mlx4_core failed: Invalid or missing namespace <ElfSetNamespaceInfo failed>

2017-03-29T21:22:45.117Z cpu6:66034)WARNING: Mod: 1690: <mlx_compat>: Export of <memmove>@<com.mellanox.compat> failed: already exported in name-space <vmkernel> by <vmkernel>

2017-03-29T21:22:45.117Z cpu6:66034)WARNING: Elf: 1908: Module <mlx_compat> - failed to finalize symbols

2017-03-29T21:22:45.117Z cpu6:66034)WARNING: Elf: 3017: Kernel based module load of mlx_compat failed: Already exists <ElfExportSymbols failed>

2017-03-29T21:22:45.911Z cpu3:66034)WARNING: Mod: 1690: <mlx_compat>: Export of <memmove>@<com.mellanox.compat> failed: already exported in name-space <vmkernel> by <vmkernel>

2017-03-29T21:22:45.911Z cpu3:66034)WARNING: Elf: 1908: Module <mlx_compat> - failed to finalize symbols

2017-03-29T21:22:45.911Z cpu3:66034)WARNING: Elf: 3017: Kernel based module load of mlx_compat failed: Already exists <ElfExportSymbols failed>

2017-03-29T21:22:46.703Z cpu3:66034)WARNING: Elf: 2219: Load of <mlx4_core> failed : missing required namespace <com.mellanox.compat#9.2.3.0>

2017-03-29T21:22:46.703Z cpu3:66034)WARNING: Elf: 3017: Kernel based module load of mlx4_core failed: Invalid or missing namespace <ElfSetNamespaceInfo failed>

2017-03-29T21:22:47.503Z cpu3:66034)WARNING: Elf: 2219: Load of <mlx4_en> failed : missing required namespace <com.mellanox.compat#9.2.3.0>

2017-03-29T21:22:47.503Z cpu3:66034)WARNING: Elf: 3017: Kernel based module load of mlx4_en failed: Invalid or missing namespace <ElfSetNamespaceInfo failed>

2017-03-29T21:22:48.310Z cpu4:66053)WARNING: Mod: 1690: <mlx_compat>: Export of <memmove>@<com.mellanox.compat> failed: already exported in name-space <vmkernel> by <vmkernel>

2017-03-29T21:22:48.310Z cpu4:66053)WARNING: Elf: 1908: Module <mlx_compat> - failed to finalize symbols

2017-03-29T21:22:48.310Z cpu4:66053)WARNING: Elf: 3017: Kernel based module load of mlx_compat failed: Already exists <ElfExportSymbols failed>

2017-03-29T21:22:49.299Z cpu4:66053)WARNING: Elf: 2219: Load of <ib_core> failed : missing required namespace <com.mellanox.compat#9.2.3.0>

2017-03-29T21:22:49.299Z cpu4:66053)WARNING: Elf: 3017: Kernel based module load of ib_core failed: Invalid or missing namespace <ElfSetNamespaceInfo failed>

2017-03-29T21:22:50.105Z cpu2:66054)WARNING: Mod: 1690: <mlx_compat>: Export of <memmove>@<com.mellanox.compat> failed: already exported in name-space <vmkernel> by <vmkernel>

2017-03-29T21:22:50.105Z cpu2:66054)WARNING: Elf: 1908: Module <mlx_compat> - failed to finalize symbols

2017-03-29T21:22:50.105Z cpu2:66054)WARNING: Elf: 3017: Kernel based module load of mlx_compat failed: Already exists <ElfExportSymbols failed>

2017-03-29T21:22:50.849Z cpu2:66054)WARNING: Elf: 2219: Load of <ib_core> failed : missing required namespace <com.mellanox.compat#9.2.3.0>

2017-03-29T21:22:50.849Z cpu2:66054)WARNING: Elf: 3017: Kernel based module load of ib_core failed: Invalid or missing namespace <ElfSetNamespaceInfo failed>

2017-03-29T21:22:51.659Z cpu2:66054)WARNING: Mod: 1690: <mlx_compat>: Export of <memmove>@<com.mellanox.compat> failed: already exported in name-space <vmkernel> by <vmkernel>

2017-03-29T21:22:51.659Z cpu2:66054)WARNING: Elf: 1908: Module <mlx_compat> - failed to finalize symbols

2017-03-29T21:22:51.659Z cpu2:66054)WARNING: Elf: 3017: Kernel based module load of mlx_compat failed: Already exists <ElfExportSymbols failed>

2017-03-29T21:22:52.465Z cpu2:66054)WARNING: Elf: 2219: Load of <ib_core> failed : missing required namespace <com.mellanox.compat#9.2.3.0>

2017-03-29T21:22:52.465Z cpu2:66054)WARNING: Elf: 3017: Kernel based module load of ib_core failed: Invalid or missing namespace <ElfSetNamespaceInfo failed>

2017-03-29T21:22:53.229Z cpu2:66054)WARNING: Mod: 1690: <mlx_compat>: Export of <memmove>@<com.mellanox.compat> failed: already exported in name-space <vmkernel> by <vmkernel>

2017-03-29T21:22:53.229Z cpu2:66054)WARNING: Elf: 1908: Module <mlx_compat> - failed to finalize symbols

2017-03-29T21:22:53.229Z cpu2:66054)WARNING: Elf: 3017: Kernel based module load of mlx_compat failed: Already exists <ElfExportSymbols failed>

2017-03-29T21:22:54.084Z cpu2:66054)WARNING: Mod: 1690: <mlx_compat>: Export of <memmove>@<com.mellanox.compat> failed: already exported in name-space <vmkernel> by <vmkernel>

2017-03-29T21:22:54.084Z cpu2:66054)WARNING: Elf: 1908: Module <mlx_compat> - failed to finalize symbols

2017-03-29T21:22:54.084Z cpu2:66054)WARNING: Elf: 3017: Kernel based module load of mlx_compat failed: Already exists <ElfExportSymbols failed>

2017-03-29T21:22:54.889Z cpu2:66054)WARNING: Elf: 2219: Load of <ib_core> failed : missing required namespace <com.mellanox.compat#9.2.3.0>

2017-03-29T21:22:54.889Z cpu2:66054)WARNING: Elf: 3017: Kernel based module load of ib_core failed: Invalid or missing namespace <ElfSetNamespaceInfo failed>

2017-03-29T21:22:55.698Z cpu2:66054)WARNING: Elf: 2219: Load of <ib_mad> failed : missing required namespace <com.mellanox.compat#9.2.3.0>

2017-03-29T21:22:55.698Z cpu2:66054)WARNING: Elf: 3017: Kernel based module load of ib_mad failed: Invalid or missing namespace <ElfSetNamespaceInfo failed>

2017-03-29T21:22:56.706Z cpu5:66055)WARNING: Mod: 1690: <mlx_compat>: Export of <memmove>@<com.mellanox.compat> failed: already exported in name-space <vmkernel> by <vmkernel>

2017-03-29T21:22:56.706Z cpu5:66055)WARNING: Elf: 1908: Module <mlx_compat> - failed to finalize symbols

2017-03-29T21:22:56.706Z cpu5:66055)WARNING: Elf: 3017: Kernel based module load of mlx_compat failed: Already exists <ElfExportSymbols failed>

2017-03-29T21:22:57.319Z cpu5:66055)WARNING: Elf: 2219: Load of <ib_core> failed : missing required namespace <com.mellanox.compat#9.2.3.0>

2017-03-29T21:22:57.319Z cpu5:66055)WARNING: Elf: 3017: Kernel based module load of ib_core failed: Invalid or missing namespace <ElfSetNamespaceInfo failed>

2017-03-29T21:22:58.130Z cpu2:66055)WARNING: Mod: 1690: <mlx_compat>: Export of <memmove>@<com.mellanox.compat> failed: already exported in name-space <vmkernel> by <vmkernel>

2017-03-29T21:22:58.130Z cpu2:66055)WARNING: Elf: 1908: Module <mlx_compat> - failed to finalize symbols

2017-03-29T21:22:58.130Z cpu2:66055)WARNING: Elf: 3017: Kernel based module load of mlx_compat failed: Already exists <ElfExportSymbols failed>

2017-03-29T21:22:58.923Z cpu2:66055)WARNING: Elf: 2219: Load of <ib_core> failed : missing required namespace <com.mellanox.compat#9.2.3.0>

2017-03-29T21:22:58.923Z cpu2:66055)WARNING: Elf: 3017: Kernel based module load of ib_core failed: Invalid or missing namespace <ElfSetNamespaceInfo failed>

2017-03-29T21:22:59.705Z cpu2:66055)WARNING: Mod: 1690: <mlx_compat>: Export of <memmove>@<com.mellanox.compat> failed: already exported in name-space <vmkernel> by <vmkernel>

2017-03-29T21:22:59.705Z cpu2:66055)WARNING: Elf: 1908: Module <mlx_compat> - failed to finalize symbols

2017-03-29T21:22:59.705Z cpu2:66055)WARNING: Elf: 3017: Kernel based module load of mlx_compat failed: Already exists <ElfExportSymbols failed>

2017-03-29T21:23:00.314Z cpu2:66055)WARNING: Mod: 1690: <mlx_compat>: Export of <memmove>@<com.mellanox.compat> failed: already exported in name-space <vmkernel> by <vmkernel>

2017-03-29T21:23:00.314Z cpu2:66055)WARNING: Elf: 1908: Module <mlx_compat> - failed to finalize symbols

2017-03-29T21:23:00.314Z cpu2:66055)WARNING: Elf: 3017: Kernel based module load of mlx_compat failed: Already exists <ElfExportSymbols failed>

2017-03-29T21:23:01.109Z cpu2:66055)WARNING: Elf: 2219: Load of <ib_core> failed : missing required namespace <com.mellanox.compat#9.2.3.0>

2017-03-29T21:23:01.109Z cpu2:66055)WARNING: Elf: 3017: Kernel based module load of ib_core failed: Invalid or missing namespace <ElfSetNamespaceInfo failed>

2017-03-29T21:23:01.909Z cpu2:66055)WARNING: Elf: 2219: Load of <ib_mad> failed : missing required namespace <com.mellanox.compat#9.2.3.0>

2017-03-29T21:23:01.909Z cpu2:66055)WARNING: Elf: 3017: Kernel based module load of ib_mad failed: Invalid or missing namespace <ElfSetNamespaceInfo failed>

2017-03-29T21:23:02.712Z cpu2:66055)WARNING: Mod: 1690: <mlx_compat>: Export of <memmove>@<com.mellanox.compat> failed: already exported in name-space <vmkernel> by <vmkernel>

2017-03-29T21:23:02.712Z cpu2:66055)WARNING: Elf: 1908: Module <mlx_compat> - failed to finalize symbols

2017-03-29T21:23:02.712Z cpu2:66055)WARNING: Elf: 3017: Kernel based module load of mlx_compat failed: Already exists <ElfExportSymbols failed>

2017-03-29T21:23:03.309Z cpu2:66055)WARNING: Elf: 2219: Load of <ib_core> failed : missing required namespace <com.mellanox.compat#9.2.3.0>

2017-03-29T21:23:03.309Z cpu2:66055)WARNING: Elf: 3017: Kernel based module load of ib_core failed: Invalid or missing namespace <ElfSetNamespaceInfo failed>

2017-03-29T21:23:04.112Z cpu2:66055)WARNING: Mod: 1690: <mlx_compat>: Export of <memmove>@<com.mellanox.compat> failed: already exported in name-space <vmkernel> by <vmkernel>

2017-03-29T21:23:04.112Z cpu2:66055)WARNING: Elf: 1908: Module <mlx_compat> - failed to finalize symbols

2017-03-29T21:23:04.112Z cpu2:66055)WARNING: Elf: 3017: Kernel based module load of mlx_compat failed: Already exists <ElfExportSymbols failed>

2017-03-29T21:23:04.907Z cpu2:66055)WARNING: Elf: 2219: Load of <ib_core> failed : missing required namespace <com.mellanox.compat#9.2.3.0>

2017-03-29T21:23:04.907Z cpu2:66055)WARNING: Elf: 3017: Kernel based module load of ib_core failed: Invalid or missing namespace <ElfSetNamespaceInfo failed>

2017-03-29T21:23:05.712Z cpu2:66055)WARNING: Mod: 1690: <mlx_compat>: Export of <memmove>@<com.mellanox.compat> failed: already exported in name-space <vmkernel> by <vmkernel>

2017-03-29T21:23:05.712Z cpu2:66055)WARNING: Elf: 1908: Module <mlx_compat> - failed to finalize symbols

2017-03-29T21:23:05.712Z cpu2:66055)WARNING: Elf: 3017: Kernel based module load of mlx_compat failed: Already exists <ElfExportSymbols failed>

2017-03-29T21:23:06.309Z cpu2:66055)WARNING: Elf: 2219: Load of <ib_core> failed : missing required namespace <com.mellanox.compat#9.2.3.0>

2017-03-29T21:23:06.309Z cpu2:66055)WARNING: Elf: 3017: Kernel based module load of ib_core failed: Invalid or missing namespace <ElfSetNamespaceInfo failed>

2017-03-29T21:23:07.111Z cpu2:66055)WARNING: Mod: 1690: <mlx_compat>: Export of <memmove>@<com.mellanox.compat> failed: already exported in name-space <vmkernel> by <vmkernel>

2017-03-29T21:23:07.111Z cpu2:66055)WARNING: Elf: 1908: Module <mlx_compat> - failed to finalize symbols

2017-03-29T21:23:07.111Z cpu2:66055)WARNING: Elf: 3017: Kernel based module load of mlx_compat failed: Already exists <ElfExportSymbols failed>

2017-03-29T21:23:07.910Z cpu2:66055)WARNING: Mod: 1690: <mlx_compat>: Export of <memmove>@<com.mellanox.compat> failed: already exported in name-space <vmkernel> by <vmkernel>

2017-03-29T21:23:07.910Z cpu2:66055)WARNING: Elf: 1908: Module <mlx_compat> - failed to finalize symbols

2017-03-29T21:23:07.910Z cpu2:66055)WARNING: Elf: 3017: Kernel based module load of mlx_compat failed: Already exists <ElfExportSymbols failed>

2017-03-29T21:23:08.709Z cpu2:66055)WARNING: Elf: 2219: Load of <ib_core> failed : missing required namespace <com.mellanox.compat#9.2.3.0>

2017-03-29T21:23:08.709Z cpu2:66055)WARNING: Elf: 3017: Kernel based module load of ib_core failed: Invalid or missing namespace <ElfSetNamespaceInfo failed>

2017-03-29T21:23:09.302Z cpu2:66055)WARNING: Elf: 2219: Load of <ib_mad> failed : missing required namespace <com.mellanox.compat#9.2.3.0>

2017-03-29T21:23:09.302Z cpu2:66055)WARNING: Elf: 3017: Kernel based module load of ib_mad failed: Invalid or missing namespace <ElfSetNamespaceInfo failed>

2017-03-29T21:23:10.121Z cpu2:66055)WARNING: Mod: 1690: <mlx_compat>: Export of <memmove>@<com.mellanox.compat> failed: already exported in name-space <vmkernel> by <vmkernel>

2017-03-29T21:23:10.121Z cpu2:66055)WARNING: Elf: 1908: Module <mlx_compat> - failed to finalize symbols

2017-03-29T21:23:10.121Z cpu2:66055)WARNING: Elf: 3017: Kernel based module load of mlx_compat failed: Already exists <ElfExportSymbols failed>

2017-03-29T21:23:10.912Z cpu2:66055)WARNING: Mod: 1690: <mlx_compat>: Export of <memmove>@<com.mellanox.compat> failed: already exported in name-space <vmkernel> by <vmkernel>

2017-03-29T21:23:10.912Z cpu2:66055)WARNING: Elf: 1908: Module <mlx_compat> - failed to finalize symbols

2017-03-29T21:23:10.912Z cpu2:66055)WARNING: Elf: 3017: Kernel based module load of mlx_compat failed: Already exists <ElfExportSymbols failed>

2017-03-29T21:23:11.719Z cpu2:66055)WARNING: Elf: 2219: Load of <ib_core> failed : missing required namespace <com.mellanox.compat#9.2.3.0>

2017-03-29T21:23:11.719Z cpu2:66055)WARNING: Elf: 3017: Kernel based module load of ib_core failed: Invalid or missing namespace <ElfSetNamespaceInfo failed>

2017-03-29T21:23:12.322Z cpu2:66055)WARNING: Mod: 1690: <mlx_compat>: Export of <memmove>@<com.mellanox.compat> failed: already exported in name-space <vmkernel> by <vmkernel>

2017-03-29T21:23:12.322Z cpu2:66055)WARNING: Elf: 1908: Module <mlx_compat> - failed to finalize symbols

2017-03-29T21:23:12.322Z cpu2:66055)WARNING: Elf: 3017: Kernel based module load of mlx_compat failed: Already exists <ElfExportSymbols failed>

2017-03-29T21:23:13.107Z cpu2:66055)WARNING: Elf: 2219: Load of <ib_core> failed : missing required namespace <com.mellanox.compat#9.2.3.0>

2017-03-29T21:23:13.107Z cpu2:66055)WARNING: Elf: 3017: Kernel based module load of ib_core failed: Invalid or missing namespace <ElfSetNamespaceInfo failed>

2017-03-29T21:23:13.911Z cpu2:66055)WARNING: Mod: 1690: <mlx_compat>: Export of <memmove>@<com.mellanox.compat> failed: already exported in name-space <vmkernel> by <vmkernel>

2017-03-29T21:23:13.911Z cpu2:66055)WARNING: Elf: 1908: Module <mlx_compat> - failed to finalize symbols

2017-03-29T21:23:13.911Z cpu2:66055)WARNING: Elf: 3017: Kernel based module load of mlx_compat failed: Already exists <ElfExportSymbols failed>

2017-03-29T21:23:14.712Z cpu2:66055)WARNING: Mod: 1690: <mlx_compat>: Export of <memmove>@<com.mellanox.compat> failed: already exported in name-space <vmkernel> by <vmkernel>

2017-03-29T21:23:14.712Z cpu2:66055)WARNING: Elf: 1908: Module <mlx_compat> - failed to finalize symbols

2017-03-29T21:23:14.712Z cpu2:66055)WARNING: Elf: 3017: Kernel based module load of mlx_compat failed: Already exists <ElfExportSymbols failed>

2017-03-29T21:23:15.309Z cpu2:66055)WARNING: Elf: 2219: Load of <ib_core> failed : missing required namespace <com.mellanox.compat#9.2.3.0>

2017-03-29T21:23:15.309Z cpu2:66055)WARNING: Elf: 3017: Kernel based module load of ib_core failed: Invalid or missing namespace <ElfSetNamespaceInfo failed>

2017-03-29T21:23:16.109Z cpu2:66055)WARNING: Elf: 2219: Load of <ib_mad> failed : missing required namespace <com.mellanox.compat#9.2.3.0>

2017-03-29T21:23:16.109Z cpu2:66055)WARNING: Elf: 3017: Kernel based module load of ib_mad failed: Invalid or missing namespace <ElfSetNamespaceInfo failed>

2017-03-29T21:23:16.909Z cpu2:66055)WARNING: Elf: 2219: Load of <ib_sa> failed : missing required namespace <com.mellanox.compat#9.2.3.0>

2017-03-29T21:23:16.909Z cpu2:66055)WARNING: Elf: 3017: Kernel based module load of ib_sa failed: Invalid or missing namespace <ElfSetNamespaceInfo failed>

2017-03-29T21:23:17.716Z cpu2:66056)WARNING: Mod: 1690: <mlx_compat>: Export of <memmove>@<com.mellanox.compat> failed: already exported in name-space <vmkernel> by <vmkernel>

2017-03-29T21:23:17.716Z cpu2:66056)WARNING: Elf: 1908: Module <mlx_compat> - failed to finalize symbols

2017-03-29T21:23:17.716Z cpu2:66056)WARNING: Elf: 3017: Kernel based module load of mlx_compat failed: Already exists <ElfExportSymbols failed>

2017-03-29T21:23:18.312Z cpu2:66056)WARNING: Elf: 2219: Load of <mlx4_core> failed : missing required namespace <com.mellanox.compat#9.2.3.0>

2017-03-29T21:23:18.312Z cpu2:66056)WARNING: Elf: 3017: Kernel based module load of mlx4_core failed: Invalid or missing namespace <ElfSetNamespaceInfo failed>

2017-03-29T21:23:19.109Z cpu2:66056)WARNING: Mod: 1690: <mlx_compat>: Export of <memmove>@<com.mellanox.compat> failed: already exported in name-space <vmkernel> by <vmkernel>

2017-03-29T21:23:19.109Z cpu2:66056)WARNING: Elf: 1908: Module <mlx_compat> - failed to finalize symbols

2017-03-29T21:23:19.109Z cpu2:66056)WARNING: Elf: 3017: Kernel based module load of mlx_compat failed: Already exists <ElfExportSymbols failed>

2017-03-29T21:23:19.909Z cpu2:66056)WARNING: Elf: 2219: Load of <ib_core> failed : missing required namespace <com.mellanox.compat#9.2.3.0>

2017-03-29T21:23:19.909Z cpu2:66056)WARNING: Elf: 3017: Kernel based module load of ib_core failed: Invalid or missing namespace <ElfSetNamespaceInfo failed>

2017-03-29T21:23:20.712Z cpu2:66056)WARNING: Mod: 1690: <mlx_compat>: Export of <memmove>@<com.mellanox.compat> failed: already exported in name-space <vmkernel> by <vmkernel>

2017-03-29T21:23:20.712Z cpu2:66056)WARNING: Elf: 1908: Module <mlx_compat> - failed to finalize symbols

2017-03-29T21:23:20.712Z cpu2:66056)WARNING: Elf: 3017: Kernel based module load of mlx_compat failed: Already exists <ElfExportSymbols failed>

2017-03-29T21:23:21.347Z cpu2:66056)WARNING: Elf: 2219: Load of <ib_core> failed : missing required namespace <com.mellanox.compat#9.2.3.0>

2017-03-29T21:23:21.347Z cpu2:66056)WARNING: Elf: 3017: Kernel based module load of ib_core failed: Invalid or missing namespace <ElfSetNamespaceInfo failed>

2017-03-29T21:23:22.166Z cpu2:66056)WARNING: Mod: 1690: <mlx_compat>: Export of <memmove>@<com.mellanox.compat> failed: already exported in name-space <vmkernel> by <vmkernel>

2017-03-29T21:23:22.166Z cpu2:66056)WARNING: Elf: 1908: Module <mlx_compat> - failed to finalize symbols

2017-03-29T21:23:22.166Z cpu2:66056)WARNING: Elf: 3017: Kernel based module load of mlx_compat failed: Already exists <ElfExportSymbols failed>

2017-03-29T21:23:22.983Z cpu2:66056)WARNING: Mod: 1690: <mlx_compat>: Export of <memmove>@<com.mellanox.compat> failed: already exported in name-space <vmkernel> by <vmkernel>

2017-03-29T21:23:22.983Z cpu2:66056)WARNING: Elf: 1908: Module <mlx_compat> - failed to finalize symbols

2017-03-29T21:23:22.983Z cpu2:66056)WARNING: Elf: 3017: Kernel based module load of mlx_compat failed: Already exists <ElfExportSymbols failed>

2017-03-29T21:23:23.799Z cpu2:66056)WARNING: Elf: 2219: Load of <ib_core> failed : missing required namespace <com.mellanox.compat#9.2.3.0>

2017-03-29T21:23:23.799Z cpu2:66056)WARNING: Elf: 3017: Kernel based module load of ib_core failed: Invalid or missing namespace <ElfSetNamespaceInfo failed>

2017-03-29T21:23:24.343Z cpu2:66056)WARNING: Elf: 2219: Load of <ib_mad> failed : missing required namespace <com.mellanox.compat#9.2.3.0>

2017-03-29T21:23:24.343Z cpu2:66056)WARNING: Elf: 3017: Kernel based module load of ib_mad failed: Invalid or missing namespace <ElfSetNamespaceInfo failed>

2017-03-29T21:23:25.301Z cpu2:66056)WARNING: Mod: 1690: <mlx_compat>: Export of <memmove>@<com.mellanox.compat> failed: already exported in name-space <vmkernel> by <vmkernel>

2017-03-29T21:23:25.301Z cpu2:66056)WARNING: Elf: 1908: Module <mlx_compat> - failed to finalize symbols

2017-03-29T21:23:25.301Z cpu2:66056)WARNING: Elf: 3017: Kernel based module load of mlx_compat failed: Already exists <ElfExportSymbols failed>

2017-03-29T21:23:26.297Z cpu2:66056)WARNING: Elf: 2219: Load of <ib_core> failed : missing required namespace <com.mellanox.compat#9.2.3.0>

2017-03-29T21:23:26.297Z cpu2:66056)WARNING: Elf: 3017: Kernel based module load of ib_core failed: Invalid or missing namespace <ElfSetNamespaceInfo failed>

2017-03-29T21:23:27.102Z cpu2:66056)WARNING: Mod: 1690: <mlx_compat>: Export of <memmove>@<com.mellanox.compat> failed: already exported in name-space <vmkernel> by <vmkernel>

2017-03-29T21:23:27.102Z cpu2:66056)WARNING: Elf: 1908: Module <mlx_compat> - failed to finalize symbols

2017-03-29T21:23:27.102Z cpu2:66056)WARNING: Elf: 3017: Kernel based module load of mlx_compat failed: Already exists <ElfExportSymbols failed>

2017-03-29T21:23:27.799Z cpu2:66056)WARNING: Elf: 2219: Load of <ib_core> failed : missing required namespace <com.mellanox.compat#9.2.3.0>

2017-03-29T21:23:27.799Z cpu2:66056)WARNING: Elf: 3017: Kernel based module load of ib_core failed: Invalid or missing namespace <ElfSetNamespaceInfo failed>

2017-03-29T21:23:28.702Z cpu2:66056)WARNING: Mod: 1690: <mlx_compat>: Export of <memmove>@<com.mellanox.compat> failed: already exported in name-space <vmkernel> by <vmkernel>

2017-03-29T21:23:28.702Z cpu2:66056)WARNING: Elf: 1908: Module <mlx_compat> - failed to finalize symbols

2017-03-29T21:23:28.702Z cpu2:66056)WARNING: Elf: 3017: Kernel based module load of mlx_compat failed: Already exists <ElfExportSymbols failed>

2017-03-29T21:23:29.362Z cpu2:66056)WARNING: Elf: 2219: Load of <ib_core> failed : missing required namespace <com.mellanox.compat#9.2.3.0>

2017-03-29T21:23:29.362Z cpu2:66056)WARNING: Elf: 3017: Kernel based module load of ib_core failed: Invalid or missing namespace <ElfSetNamespaceInfo failed>

2017-03-29T21:23:30.299Z cpu2:66056)WARNING: Mod: 1690: <mlx_compat>: Export of <memmove>@<com.mellanox.compat> failed: already exported in name-space <vmkernel> by <vmkernel>

2017-03-29T21:23:30.299Z cpu2:66056)WARNING: Elf: 1908: Module <mlx_compat> - failed to finalize symbols

2017-03-29T21:23:30.299Z cpu2:66056)WARNING: Elf: 3017: Kernel based module load of mlx_compat failed: Already exists <ElfExportSymbols failed>

2017-03-29T21:23:30.871Z cpu2:66056)WARNING: Mod: 1690: <mlx_compat>: Export of <memmove>@<com.mellanox.compat> failed: already exported in name-space <vmkernel> by <vmkernel>

2017-03-29T21:23:30.871Z cpu2:66056)WARNING: Elf: 1908: Module <mlx_compat> - failed to finalize symbols

2017-03-29T21:23:30.871Z cpu2:66056)WARNING: Elf: 3017: Kernel based module load of mlx_compat failed: Already exists <ElfExportSymbols failed>

2017-03-29T21:23:31.699Z cpu2:66056)WARNING: Elf: 2219: Load of <ib_core> failed : missing required namespace <com.mellanox.compat#9.2.3.0>

2017-03-29T21:23:31.699Z cpu2:66056)WARNING: Elf: 3017: Kernel based module load of ib_core failed: Invalid or missing namespace <ElfSetNamespaceInfo failed>

2017-03-29T21:23:32.375Z cpu2:66056)WARNING: Elf: 2219: Load of <ib_mad> failed : missing required namespace <com.mellanox.compat#9.2.3.0>

2017-03-29T21:23:32.375Z cpu2:66056)WARNING: Elf: 3017: Kernel based module load of ib_mad failed: Invalid or missing namespace <ElfSetNamespaceInfo failed>

2017-03-29T21:23:33.273Z cpu2:66056)WARNING: Mod: 1690: <mlx_compat>: Export of <memmove>@<com.mellanox.compat> failed: already exported in name-space <vmkernel> by <vmkernel>

2017-03-29T21:23:33.273Z cpu2:66056)WARNING: Elf: 1908: Module <mlx_compat> - failed to finalize symbols

2017-03-29T21:23:33.273Z cpu2:66056)WARNING: Elf: 3017: Kernel based module load of mlx_compat failed: Already exists <ElfExportSymbols failed>

2017-03-29T21:23:33.799Z cpu2:66056)WARNING: Elf: 2219: Load of <ib_core> failed : missing required namespace <com.mellanox.compat#9.2.3.0>

2017-03-29T21:23:33.799Z cpu2:66056)WARNING: Elf: 3017: Kernel based module load of ib_core failed: Invalid or missing namespace <ElfSetNamespaceInfo failed>

2017-03-29T21:23:34.702Z cpu2:66056)WARNING: Mod: 1690: <mlx_compat>: Export of <memmove>@<com.mellanox.compat> failed: already exported in name-space <vmkernel> by <vmkernel>

2017-03-29T21:23:34.702Z cpu2:66056)WARNING: Elf: 1908: Module <mlx_compat> - failed to finalize symbols

2017-03-29T21:23:34.702Z cpu2:66056)WARNING: Elf: 3017: Kernel based module load of mlx_compat failed: Already exists <ElfExportSymbols failed>

2017-03-29T21:23:35.399Z cpu2:66056)WARNING: Elf: 2219: Load of <ib_core> failed : missing required namespace <com.mellanox.compat#9.2.3.0>

2017-03-29T21:23:35.399Z cpu2:66056)WARNING: Elf: 3017: Kernel based module load of ib_core failed: Invalid or missing namespace <ElfSetNamespaceInfo failed>

2017-03-29T21:23:36.290Z cpu2:66056)WARNING: Mod: 1690: <mlx_compat>: Export of <memmove>@<com.mellanox.compat> failed: already exported in name-space <vmkernel> by <vmkernel>

2017-03-29T21:23:36.290Z cpu2:66056)WARNING: Elf: 1908: Module <mlx_compat> - failed to finalize symbols

2017-03-29T21:23:36.290Z cpu2:66056)WARNING: Elf: 3017: Kernel based module load of mlx_compat failed: Already exists <ElfExportSymbols failed>

2017-03-29T21:23:36.896Z cpu2:66056)WARNING: Mod: 1690: <mlx_compat>: Export of <memmove>@<com.mellanox.compat> failed: already exported in name-space <vmkernel> by <vmkernel>

2017-03-29T21:23:36.896Z cpu2:66056)WARNING: Elf: 1908: Module <mlx_compat> - failed to finalize symbols

2017-03-29T21:23:36.896Z cpu2:66056)WARNING: Elf: 3017: Kernel based module load of mlx_compat failed: Already exists <ElfExportSymbols failed>

2017-03-29T21:23:37.799Z cpu2:66056)WARNING: Elf: 2219: Load of <ib_core> failed : missing required namespace <com.mellanox.compat#9.2.3.0>

2017-03-29T21:23:37.799Z cpu2:66056)WARNING: Elf: 3017: Kernel based module load of ib_core failed: Invalid or missing namespace <ElfSetNamespaceInfo failed>

2017-03-29T21:23:38.699Z cpu2:66056)WARNING: Elf: 2219: Load of <ib_mad> failed : missing required namespace <com.mellanox.compat#9.2.3.0>

2017-03-29T21:23:38.699Z cpu2:66056)WARNING: Elf: 3017: Kernel based module load of ib_mad failed: Invalid or missing namespace <ElfSetNamespaceInfo failed>

2017-03-29T21:23:39.406Z cpu2:66056)WARNING: Mod: 1690: <mlx_compat>: Export of <memmove>@<com.mellanox.compat> failed: already exported in name-space <vmkernel> by <vmkernel>

2017-03-29T21:23:39.406Z cpu2:66056)WARNING: Elf: 1908: Module <mlx_compat> - failed to finalize symbols

2017-03-29T21:23:39.406Z cpu2:66056)WARNING: Elf: 3017: Kernel based module load of mlx_compat failed: Already exists <ElfExportSymbols failed>

2017-03-29T21:23:40.296Z cpu2:66056)WARNING: Elf: 2219: Load of <ib_core> failed : missing required namespace <com.mellanox.compat#9.2.3.0>

2017-03-29T21:23:40.296Z cpu2:66056)WARNING: Elf: 3017: Kernel based module load of ib_core failed: Invalid or missing namespace <ElfSetNamespaceInfo failed>

2017-03-29T21:23:41.301Z cpu2:66056)WARNING: Mod: 1690: <mlx_compat>: Export of <memmove>@<com.mellanox.compat> failed: already exported in name-space <vmkernel> by <vmkernel>

2017-03-29T21:23:41.301Z cpu2:66056)WARNING: Elf: 1908: Module <mlx_compat> - failed to finalize symbols

2017-03-29T21:23:41.301Z cpu2:66056)WARNING: Elf: 3017: Kernel based module load of mlx_compat failed: Already exists <ElfExportSymbols failed>

2017-03-29T21:23:41.909Z cpu2:66056)WARNING: Elf: 2219: Load of <ib_core> failed : missing required namespace <com.mellanox.compat#9.2.3.0>

2017-03-29T21:23:41.909Z cpu2:66056)WARNING: Elf: 3017: Kernel based module load of ib_core failed: Invalid or missing namespace <ElfSetNamespaceInfo failed>

2017-03-29T21:23:42.712Z cpu2:66056)WARNING: Mod: 1690: <mlx_compat>: Export of <memmove>@<com.mellanox.compat> failed: already exported in name-space <vmkernel> by <vmkernel>

2017-03-29T21:23:42.712Z cpu2:66056)WARNING: Elf: 1908: Module <mlx_compat> - failed to finalize symbols

2017-03-29T21:23:42.712Z cpu2:66056)WARNING: Elf: 3017: Kernel based module load of mlx_compat failed: Already exists <ElfExportSymbols failed>

2017-03-29T21:23:43.509Z cpu2:66056)WARNING: Elf: 2219: Load of <ib_core> failed : missing required namespace <com.mellanox.compat#9.2.3.0>

2017-03-29T21:23:43.509Z cpu2:66056)WARNING: Elf: 3017: Kernel based module load of ib_core failed: Invalid or missing namespace <ElfSetNamespaceInfo failed>

2017-03-29T21:23:44.311Z cpu2:66056)WARNING: Mod: 1690: <mlx_compat>: Export of <memmove>@<com.mellanox.compat> failed: already exported in name-space <vmkernel> by <vmkernel>

2017-03-29T21:23:44.311Z cpu2:66056)WARNING: Elf: 1908: Module <mlx_compat> - failed to finalize symbols

2017-03-29T21:23:44.311Z cpu2:66056)WARNING: Elf: 3017: Kernel based module load of mlx_compat failed: Already exists <ElfExportSymbols failed>

2017-03-29T21:23:45.110Z cpu2:66056)WARNING: Mod: 1690: <mlx_compat>: Export of <memmove>@<com.mellanox.compat> failed: already exported in name-space <vmkernel> by <vmkernel>

2017-03-29T21:23:45.110Z cpu2:66056)WARNING: Elf: 1908: Module <mlx_compat> - failed to finalize symbols

2017-03-29T21:23:45.110Z cpu2:66056)WARNING: Elf: 3017: Kernel based module load of mlx_compat failed: Already exists <ElfExportSymbols failed>

2017-03-29T21:23:45.709Z cpu2:66056)WARNING: Elf: 2219: Load of <ib_core> failed : missing required namespace <com.mellanox.compat#9.2.3.0>

2017-03-29T21:23:45.709Z cpu2:66056)WARNING: Elf: 3017: Kernel based module load of ib_core failed: Invalid or missing namespace <ElfSetNamespaceInfo failed>

2017-03-29T21:23:46.509Z cpu2:66056)WARNING: Elf: 2219: Load of <ib_mad> failed : missing required namespace <com.mellanox.compat#9.2.3.0>

2017-03-29T21:23:46.509Z cpu2:66056)WARNING: Elf: 3017: Kernel based module load of ib_mad failed: Invalid or missing namespace <ElfSetNamespaceInfo failed>

2017-03-29T21:23:47.311Z cpu2:66056)WARNING: Mod: 1690: <mlx_compat>: Export of <memmove>@<com.mellanox.compat> failed: already exported in name-space <vmkernel> by <vmkernel>

2017-03-29T21:23:47.311Z cpu2:66056)WARNING: Elf: 1908: Module <mlx_compat> - failed to finalize symbols

2017-03-29T21:23:47.311Z cpu2:66056)WARNING: Elf: 3017: Kernel based module load of mlx_compat failed: Already exists <ElfExportSymbols failed>

2017-03-29T21:23:48.111Z cpu2:66056)WARNING: Mod: 1690: <mlx_compat>: Export of <memmove>@<com.mellanox.compat> failed: already exported in name-space <vmkernel> by <vmkernel>

2017-03-29T21:23:48.111Z cpu2:66056)WARNING: Elf: 1908: Module <mlx_compat> - failed to finalize symbols

2017-03-29T21:23:48.111Z cpu2:66056)WARNING: Elf: 3017: Kernel based module load of mlx_compat failed: Already exists <ElfExportSymbols failed>

2017-03-29T21:23:48.709Z cpu2:66056)WARNING: Elf: 2219: Load of <ib_core> failed : missing required namespace <com.mellanox.compat#9.2.3.0>

2017-03-29T21:23:48.709Z cpu2:66056)WARNING: Elf: 3017: Kernel based module load of ib_core failed: Invalid or missing namespace <ElfSetNamespaceInfo failed>

2017-03-29T21:23:49.512Z cpu2:66056)WARNING: Mod: 1690: <mlx_compat>: Export of <memmove>@<com.mellanox.compat> failed: already exported in name-space <vmkernel> by <vmkernel>

2017-03-29T21:23:49.512Z cpu2:66056)WARNING: Elf: 1908: Module <mlx_compat> - failed to finalize symbols

2017-03-29T21:23:49.512Z cpu2:66056)WARNING: Elf: 3017: Kernel based module load of mlx_compat failed: Already exists <ElfExportSymbols failed>

2017-03-29T21:23:50.309Z cpu2:66056)WARNING: Elf: 2219: Load of <ib_core> failed : missing required namespace <com.mellanox.compat#9.2.3.0>

2017-03-29T21:23:50.309Z cpu2:66056)WARNING: Elf: 3017: Kernel based module load of ib_core failed: Invalid or missing namespace <ElfSetNamespaceInfo failed>

2017-03-29T21:23:51.111Z cpu2:66056)WARNING: Mod: 1690: <mlx_compat>: Export of <memmove>@<com.mellanox.compat> failed: already exported in name-space <vmkernel> by <vmkernel>

2017-03-29T21:23:51.111Z cpu2:66056)WARNING: Elf: 1908: Module <mlx_compat> - failed to finalize symbols

2017-03-29T21:23:51.111Z cpu2:66056)WARNING: Elf: 3017: Kernel based module load of mlx_compat failed: Already exists <ElfExportSymbols failed>

2017-03-29T21:23:51.902Z cpu6:66056)WARNING: Mod: 1690: <mlx_compat>: Export of <memmove>@<com.mellanox.compat> failed: already exported in name-space <vmkernel> by <vmkernel>

2017-03-29T21:23:51.902Z cpu6:66056)WARNING: Elf: 1908: Module <mlx_compat> - failed to finalize symbols

2017-03-29T21:23:51.902Z cpu6:66056)WARNING: Elf: 3017: Kernel based module load of mlx_compat failed: Already exists <ElfExportSymbols failed>

2017-03-29T21:23:52.699Z cpu6:66056)WARNING: Elf: 2219: Load of <ib_core> failed : missing required namespace <com.mellanox.compat#9.2.3.0>

2017-03-29T21:23:52.699Z cpu6:66056)WARNING: Elf: 3017: Kernel based module load of ib_core failed: Invalid or missing namespace <ElfSetNamespaceInfo failed>

2017-03-29T21:23:53.499Z cpu6:66056)WARNING: Elf: 2219: Load of <ib_mad> failed : missing required namespace <com.mellanox.compat#9.2.3.0>

2017-03-29T21:23:53.499Z cpu6:66056)WARNING: Elf: 3017: Kernel based module load of ib_mad failed: Invalid or missing namespace <ElfSetNamespaceInfo failed>

2017-03-29T21:23:54.298Z cpu6:66056)WARNING: Elf: 2219: Load of <ib_sa> failed : missing required namespace <com.mellanox.compat#9.2.3.0>

2017-03-29T21:23:54.298Z cpu6:66056)WARNING: Elf: 3017: Kernel based module load of ib_sa failed: Invalid or missing namespace <ElfSetNamespaceInfo failed>

2017-03-29T21:23:54.802Z cpu6:66056)WARNING: Mod: 1690: <mlx_compat>: Export of <memmove>@<com.mellanox.compat> failed: already exported in name-space <vmkernel> by <vmkernel>

2017-03-29T21:23:54.802Z cpu6:66056)WARNING: Elf: 1908: Module <mlx_compat> - failed to finalize symbols

2017-03-29T21:23:54.802Z cpu6:66056)WARNING: Elf: 3017: Kernel based module load of mlx_compat failed: Already exists <ElfExportSymbols failed>

2017-03-29T21:23:55.699Z cpu6:66056)WARNING: Elf: 2219: Load of <ib_core> failed : missing required namespace <com.mellanox.compat#9.2.3.0>

2017-03-29T21:23:55.699Z cpu6:66056)WARNING: Elf: 3017: Kernel based module load of ib_core failed: Invalid or missing namespace <ElfSetNamespaceInfo failed>

2017-03-29T21:23:56.502Z cpu6:66056)WARNING: Mod: 1690: <mlx_compat>: Export of <memmove>@<com.mellanox.compat> failed: already exported in name-space <vmkernel> by <vmkernel>

2017-03-29T21:23:56.502Z cpu6:66056)WARNING: Elf: 1908: Module <mlx_compat> - failed to finalize symbols

2017-03-29T21:23:56.502Z cpu6:66056)WARNING: Elf: 3017: Kernel based module load of mlx_compat failed: Already exists <ElfExportSymbols failed>

2017-03-29T21:23:57.297Z cpu6:66056)WARNING: Elf: 2219: Load of <ib_core> failed : missing required namespace <com.mellanox.compat#9.2.3.0>

2017-03-29T21:23:57.297Z cpu6:66056)WARNING: Elf: 3017: Kernel based module load of ib_core failed: Invalid or missing namespace <ElfSetNamespaceInfo failed>

2017-03-29T21:23:57.901Z cpu6:66056)WARNING: Mod: 1690: <mlx_compat>: Export of <memmove>@<com.mellanox.compat> failed: already exported in name-space <vmkernel> by <vmkernel>

2017-03-29T21:23:57.901Z cpu6:66056)WARNING: Elf: 1908: Module <mlx_compat> - failed to finalize symbols

2017-03-29T21:23:57.901Z cpu6:66056)WARNING: Elf: 3017: Kernel based module load of mlx_compat failed: Already exists <ElfExportSymbols failed>

2017-03-29T21:23:58.702Z cpu6:66056)WARNING: Mod: 1690: <mlx_compat>: Export of <memmove>@<com.mellanox.compat> failed: already exported in name-space <vmkernel> by <vmkernel>

2017-03-29T21:23:58.702Z cpu6:66056)WARNING: Elf: 1908: Module <mlx_compat> - failed to finalize symbols

2017-03-29T21:23:58.702Z cpu6:66056)WARNING: Elf: 3017: Kernel based module load of mlx_compat failed: Already exists <ElfExportSymbols failed>

2017-03-29T21:23:59.499Z cpu6:66056)WARNING: Elf: 2219: Load of <ib_core> failed : missing required namespace <com.mellanox.compat#9.2.3.0>

2017-03-29T21:23:59.499Z cpu6:66056)WARNING: Elf: 3017: Kernel based module load of ib_core failed: Invalid or missing namespace <ElfSetNamespaceInfo failed>

2017-03-29T21:24:00.299Z cpu6:66056)WARNING: Elf: 2219: Load of <ib_mad> failed : missing required namespace <com.mellanox.compat#9.2.3.0>

2017-03-29T21:24:00.299Z cpu6:66056)WARNING: Elf: 3017: Kernel based module load of ib_mad failed: Invalid or missing namespace <ElfSetNamespaceInfo failed>

2017-03-29T21:24:00.802Z cpu6:66056)WARNING: Mod: 1690: <mlx_compat>: Export of <memmove>@<com.mellanox.compat> failed: already exported in name-space <vmkernel> by <vmkernel>

2017-03-29T21:24:00.802Z cpu6:66056)WARNING: Elf: 1908: Module <mlx_compat> - failed to finalize symbols

2017-03-29T21:24:00.802Z cpu6:66056)WARNING: Elf: 3017: Kernel based module load of mlx_compat failed: Already exists <ElfExportSymbols failed>

2017-03-29T21:24:01.699Z cpu6:66056)WARNING: Elf: 2219: Load of <mlx4_core> failed : missing required namespace <com.mellanox.compat#9.2.3.0>

2017-03-29T21:24:01.699Z cpu6:66056)WARNING: Elf: 3017: Kernel based module load of mlx4_core failed: Invalid or missing namespace <ElfSetNamespaceInfo failed>

2017-03-29T21:24:02.501Z cpu6:66056)WARNING: Mod: 1690: <mlx_compat>: Export of <memmove>@<com.mellanox.compat> failed: already exported in name-space <vmkernel> by <vmkernel>

2017-03-29T21:24:02.501Z cpu6:66056)WARNING: Elf: 1908: Module <mlx_compat> - failed to finalize symbols

2017-03-29T21:24:02.501Z cpu6:66056)WARNING: Elf: 3017: Kernel based module load of mlx_compat failed: Already exists <ElfExportSymbols failed>

2017-03-29T21:24:03.283Z cpu6:66056)WARNING: Mod: 1690: <mlx_compat>: Export of <memmove>@<com.mellanox.compat> failed: already exported in name-space <vmkernel> by <vmkernel>

2017-03-29T21:24:03.283Z cpu6:66056)WARNING: Elf: 1908: Module <mlx_compat> - failed to finalize symbols

2017-03-29T21:24:03.283Z cpu6:66056)WARNING: Elf: 3017: Kernel based module load of mlx_compat failed: Already exists <ElfExportSymbols failed>

2017-03-29T21:24:03.899Z cpu6:66056)WARNING: Elf: 2219: Load of <mlx4_core> failed : missing required namespace <com.mellanox.compat#9.2.3.0>

2017-03-29T21:24:03.899Z cpu6:66056)WARNING: Elf: 3017: Kernel based module load of mlx4_core failed: Invalid or missing namespace <ElfSetNamespaceInfo failed>

2017-03-29T21:24:04.699Z cpu6:66056)WARNING: Elf: 2219: Load of <mlx4_ib> failed : missing required namespace <com.mellanox.compat#9.2.3.0>

2017-03-29T21:24:04.699Z cpu6:66056)WARNING: Elf: 3017: Kernel based module load of mlx4_ib failed: Invalid or missing namespace <ElfSetNamespaceInfo failed>

2017-03-29T21:24:05.506Z cpu3:66057)WARNING: Mod: 1690: <mlx_compat>: Export of <memmove>@<com.mellanox.compat> failed: already exported in name-space <vmkernel> by <vmkernel>

2017-03-29T21:24:05.506Z cpu3:66057)WARNING: Elf: 1908: Module <mlx_compat> - failed to finalize symbols

2017-03-29T21:24:05.506Z cpu3:66057)WARNING: Elf: 3017: Kernel based module load of mlx_compat failed: Already exists <ElfExportSymbols failed>

2017-03-29T21:24:06.109Z cpu3:66057)WARNING: Elf: 2219: Load of <ib_core> failed : missing required namespace <com.mellanox.compat#9.2.3.0>

2017-03-29T21:24:06.109Z cpu3:66057)WARNING: Elf: 3017: Kernel based module load of ib_core failed: Invalid or missing namespace <ElfSetNamespaceInfo failed>

2017-03-29T21:24:06.712Z cpu3:66057)WARNING: Mod: 1690: <mlx_compat>: Export of <memmove>@<com.mellanox.compat> failed: already exported in name-space <vmkernel> by <vmkernel>

2017-03-29T21:24:06.712Z cpu3:66057)WARNING: Elf: 1908: Module <mlx_compat> - failed to finalize symbols

2017-03-29T21:24:06.712Z cpu3:66057)WARNING: Elf: 3017: Kernel based module load of mlx_compat failed: Already exists <ElfExportSymbols failed>

2017-03-29T21:24:07.509Z cpu3:66057)WARNING: Elf: 2219: Load of <ib_core> failed : missing required namespace <com.mellanox.compat#9.2.3.0>

2017-03-29T21:24:07.509Z cpu3:66057)WARNING: Elf: 3017: Kernel based module load of ib_core failed: Invalid or missing namespace <ElfSetNamespaceInfo failed>

2017-03-29T21:24:08.311Z cpu3:66057)WARNING: Mod: 1690: <mlx_compat>: Export of <memmove>@<com.mellanox.compat> failed: already exported in name-space <vmkernel> by <vmkernel>

2017-03-29T21:24:08.311Z cpu3:66057)WARNING: Elf: 1908: Module <mlx_compat> - failed to finalize symbols

2017-03-29T21:24:08.311Z cpu3:66057)WARNING: Elf: 3017: Kernel based module load of mlx_compat failed: Already exists <ElfExportSymbols failed>

2017-03-29T21:24:09.111Z cpu3:66057)WARNING: Mod: 1690: <mlx_compat>: Export of <memmove>@<com.mellanox.compat> failed: already exported in name-space <vmkernel> by <vmkernel>

2017-03-29T21:24:09.111Z cpu3:66057)WARNING: Elf: 1908: Module <mlx_compat> - failed to finalize symbols

2017-03-29T21:24:09.111Z cpu3:66057)WARNING: Elf: 3017: Kernel based module load of mlx_compat failed: Already exists <ElfExportSymbols failed>

2017-03-29T21:24:09.709Z cpu3:66057)WARNING: Elf: 2219: Load of <ib_core> failed : missing required namespace <com.mellanox.compat#9.2.3.0>

2017-03-29T21:24:09.709Z cpu3:66057)WARNING: Elf: 3017: Kernel based module load of ib_core failed: Invalid or missing namespace <ElfSetNamespaceInfo failed>

2017-03-29T21:24:10.509Z cpu3:66057)WARNING: Elf: 2219: Load of <ib_mad> failed : missing required namespace <com.mellanox.compat#9.2.3.0>

2017-03-29T21:24:10.509Z cpu3:66057)WARNING: Elf: 3017: Kernel based module load of ib_mad failed: Invalid or missing namespace <ElfSetNamespaceInfo failed>

2017-03-29T21:24:11.312Z cpu3:66057)WARNING: Mod: 1690: <mlx_compat>: Export of <memmove>@<com.mellanox.compat> failed: already exported in name-space <vmkernel> by <vmkernel>

2017-03-29T21:24:11.312Z cpu3:66057)WARNING: Elf: 1908: Module <mlx_compat> - failed to finalize symbols

2017-03-29T21:24:11.312Z cpu3:66057)WARNING: Elf: 3017: Kernel based module load of mlx_compat failed: Already exists <ElfExportSymbols failed>

2017-03-29T21:24:12.108Z cpu3:66057)WARNING: Elf: 2219: Load of <ib_core> failed : missing required namespace <com.mellanox.compat#9.2.3.0>

2017-03-29T21:24:12.108Z cpu3:66057)WARNING: Elf: 3017: Kernel based module load of ib_core failed: Invalid or missing namespace <ElfSetNamespaceInfo failed>

2017-03-29T21:24:12.722Z cpu3:66057)WARNING: Mod: 1690: <mlx_compat>: Export of <memmove>@<com.mellanox.compat> failed: already exported in name-space <vmkernel> by <vmkernel>

2017-03-29T21:24:12.722Z cpu3:66057)WARNING: Elf: 1908: Module <mlx_compat> - failed to finalize symbols

2017-03-29T21:24:12.722Z cpu3:66057)WARNING: Elf: 3017: Kernel based module load of mlx_compat failed: Already exists <ElfExportSymbols failed>

2017-03-29T21:24:13.509Z cpu3:66057)WARNING: Elf: 2219: Load of <ib_core> failed : missing required namespace <com.mellanox.compat#9.2.3.0>

2017-03-29T21:24:13.509Z cpu3:66057)WARNING: Elf: 3017: Kernel based module load of ib_core failed: Invalid or missing namespace <ElfSetNamespaceInfo failed>

2017-03-29T21:24:14.312Z cpu3:66057)WARNING: Mod: 1690: <mlx_compat>: Export of <memmove>@<com.mellanox.compat> failed: already exported in name-space <vmkernel> by <vmkernel>

2017-03-29T21:24:14.312Z cpu3:66057)WARNING: Elf: 1908: Module <mlx_compat> - failed to finalize symbols

2017-03-29T21:24:14.312Z cpu3:66057)WARNING: Elf: 3017: Kernel based module load of mlx_compat failed: Already exists <ElfExportSymbols failed>

2017-03-29T21:24:15.109Z cpu3:66057)WARNING: Elf: 2219: Load of <ib_core> failed : missing required namespace <com.mellanox.compat#9.2.3.0>

2017-03-29T21:24:15.109Z cpu3:66057)WARNING: Elf: 3017: Kernel based module load of ib_core failed: Invalid or missing namespace <ElfSetNamespaceInfo failed>

2017-03-29T21:24:15.721Z cpu3:66057)WARNING: Mod: 1690: <mlx_compat>: Export of <memmove>@<com.mellanox.compat> failed: already exported in name-space <vmkernel> by <vmkernel>

2017-03-29T21:24:15.721Z cpu3:66057)WARNING: Elf: 1908: Module <mlx_compat> - failed to finalize symbols

2017-03-29T21:24:15.721Z cpu3:66057)WARNING: Elf: 3017: Kernel based module load of mlx_compat failed: Already exists <ElfExportSymbols failed>

2017-03-29T21:24:16.512Z cpu3:66057)WARNING: Mod: 1690: <mlx_compat>: Export of <memmove>@<com.mellanox.compat> failed: already exported in name-space <vmkernel> by <vmkernel>

2017-03-29T21:24:16.512Z cpu3:66057)WARNING: Elf: 1908: Module <mlx_compat> - failed to finalize symbols

2017-03-29T21:24:16.512Z cpu3:66057)WARNING: Elf: 3017: Kernel based module load of mlx_compat failed: Already exists <ElfExportSymbols failed>

2017-03-29T21:24:17.309Z cpu3:66057)WARNING: Elf: 2219: Load of <ib_core> failed : missing required namespace <com.mellanox.compat#9.2.3.0>

2017-03-29T21:24:17.309Z cpu3:66057)WARNING: Elf: 3017: Kernel based module load of ib_core failed: Invalid or missing namespace <ElfSetNamespaceInfo failed>

2017-03-29T21:24:18.109Z cpu3:66057)WARNING: Elf: 2219: Load of <ib_mad> failed : missing required namespace <com.mellanox.compat#9.2.3.0>

2017-03-29T21:24:18.109Z cpu3:66057)WARNING: Elf: 3017: Kernel based module load of ib_mad failed: Invalid or missing namespace <ElfSetNamespaceInfo failed>

2017-03-29T21:24:18.721Z cpu3:66057)WARNING: Mod: 1690: <mlx_compat>: Export of <memmove>@<com.mellanox.compat> failed: already exported in name-space <vmkernel> by <vmkernel>

2017-03-29T21:24:18.721Z cpu3:66057)WARNING: Elf: 1908: Module <mlx_compat> - failed to finalize symbols

2017-03-29T21:24:18.721Z cpu3:66057)WARNING: Elf: 3017: Kernel based module load of mlx_compat failed: Already exists <ElfExportSymbols failed>

2017-03-29T21:24:19.512Z cpu3:66057)WARNING: Mod: 1690: <mlx_compat>: Export of <memmove>@<com.mellanox.compat> failed: already exported in name-space <vmkernel> by <vmkernel>

2017-03-29T21:24:19.512Z cpu3:66057)WARNING: Elf: 1908: Module <mlx_compat> - failed to finalize symbols

2017-03-29T21:24:19.512Z cpu3:66057)WARNING: Elf: 3017: Kernel based module load of mlx_compat failed: Already exists <ElfExportSymbols failed>

2017-03-29T21:24:20.309Z cpu3:66057)WARNING: Elf: 2219: Load of <ib_core> failed : missing required namespace <com.mellanox.compat#9.2.3.0>

2017-03-29T21:24:20.309Z cpu3:66057)WARNING: Elf: 3017: Kernel based module load of ib_core failed: Invalid or missing namespace <ElfSetNamespaceInfo failed>

2017-03-29T21:24:21.112Z cpu3:66057)WARNING: Mod: 1690: <mlx_compat>: Export of <memmove>@<com.mellanox.compat> failed: already exported in name-space <vmkernel> by <vmkernel>

2017-03-29T21:24:21.112Z cpu3:66057)WARNING: Elf: 1908: Module <mlx_compat> - failed to finalize symbols

2017-03-29T21:24:21.112Z cpu3:66057)WARNING: Elf: 3017: Kernel based module load of mlx_compat failed: Already exists <ElfExportSymbols failed>

2017-03-29T21:24:21.709Z cpu3:66057)WARNING: Elf: 2219: Load of <ib_core> failed : missing required namespace <com.mellanox.compat#9.2.3.0>

2017-03-29T21:24:21.709Z cpu3:66057)WARNING: Elf: 3017: Kernel based module load of ib_core failed: Invalid or missing namespace <ElfSetNamespaceInfo failed>

2017-03-29T21:24:22.521Z cpu3:66057)WARNING: Mod: 1690: <mlx_compat>: Export of <memmove>@<com.mellanox.compat> failed: already exported in name-space <vmkernel> by <vmkernel>

2017-03-29T21:24:22.521Z cpu3:66057)WARNING: Elf: 1908: Module <mlx_compat> - failed to finalize symbols

2017-03-29T21:24:22.521Z cpu3:66057)WARNING: Elf: 3017: Kernel based module load of mlx_compat failed: Already exists <ElfExportSymbols failed>

2017-03-29T21:24:23.312Z cpu3:66057)WARNING: Mod: 1690: <mlx_compat>: Export of <memmove>@<com.mellanox.compat> failed: already exported in name-space <vmkernel> by <vmkernel>

2017-03-29T21:24:23.312Z cpu3:66057)WARNING: Elf: 1908: Module <mlx_compat> - failed to finalize symbols

2017-03-29T21:24:23.312Z cpu3:66057)WARNING: Elf: 3017: Kernel based module load of mlx_compat failed: Already exists <ElfExportSymbols failed>

2017-03-29T21:24:24.109Z cpu3:66057)WARNING: Elf: 2219: Load of <ib_core> failed : missing required namespace <com.mellanox.compat#9.2.3.0>

2017-03-29T21:24:24.109Z cpu3:66057)WARNING: Elf: 3017: Kernel based module load of ib_core failed: Invalid or missing namespace <ElfSetNamespaceInfo failed>

2017-03-29T21:24:24.719Z cpu3:66057)WARNING: Elf: 2219: Load of <ib_mad> failed : missing required namespace <com.mellanox.compat#9.2.3.0>

2017-03-29T21:24:24.719Z cpu3:66057)WARNING: Elf: 3017: Kernel based module load of ib_mad failed: Invalid or missing namespace <ElfSetNamespaceInfo failed>

2017-03-29T21:24:25.509Z cpu3:66057)WARNING: Elf: 2219: Load of <ib_sa> failed : missing required namespace <com.mellanox.compat#9.2.3.0>

2017-03-29T21:24:25.509Z cpu3:66057)WARNING: Elf: 3017: Kernel based module load of ib_sa failed: Invalid or missing namespace <ElfSetNamespaceInfo failed>

2017-03-29T21:24:26.322Z cpu3:66057)WARNING: Mod: 1690: <mlx_compat>: Export of <memmove>@<com.mellanox.compat> failed: already exported in name-space <vmkernel> by <vmkernel>

2017-03-29T21:24:26.322Z cpu3:66057)WARNING: Elf: 1908: Module <mlx_compat> - failed to finalize symbols

2017-03-29T21:24:26.322Z cpu3:66057)WARNING: Elf: 3017: Kernel based module load of mlx_compat failed: Already exists <ElfExportSymbols failed>

2017-03-29T21:24:27.109Z cpu3:66057)WARNING: Elf: 2219: Load of <ib_core> failed : missing required namespace <com.mellanox.compat#9.2.3.0>

2017-03-29T21:24:27.109Z cpu3:66057)WARNING: Elf: 3017: Kernel based module load of ib_core failed: Invalid or missing namespace <ElfSetNamespaceInfo failed>

2017-03-29T21:24:27.723Z cpu3:66057)WARNING: Mod: 1690: <mlx_compat>: Export of <memmove>@<com.mellanox.compat> failed: already exported in name-space <vmkernel> by <vmkernel>

2017-03-29T21:24:27.723Z cpu3:66057)WARNING: Elf: 1908: Module <mlx_compat> - failed to finalize symbols

2017-03-29T21:24:27.723Z cpu3:66057)WARNING: Elf: 3017: Kernel based module load of mlx_compat failed: Already exists <ElfExportSymbols failed>

2017-03-29T21:24:28.509Z cpu3:66057)WARNING: Elf: 2219: Load of <ib_core> failed : missing required namespace <com.mellanox.compat#9.2.3.0>

2017-03-29T21:24:28.509Z cpu3:66057)WARNING: Elf: 3017: Kernel based module load of ib_core failed: Invalid or missing namespace <ElfSetNamespaceInfo failed>

2017-03-29T21:24:29.312Z cpu3:66057)WARNING: Mod: 1690: <mlx_compat>: Export of <memmove>@<com.mellanox.compat> failed: already exported in name-space <vmkernel> by <vmkernel>

2017-03-29T21:24:29.312Z cpu3:66057)WARNING: Elf: 1908: Module <mlx_compat> - failed to finalize symbols

2017-03-29T21:24:29.312Z cpu3:66057)WARNING: Elf: 3017: Kernel based module load of mlx_compat failed: Already exists <ElfExportSymbols failed>

2017-03-29T21:24:30.109Z cpu3:66057)WARNING: Elf: 2219: Load of <ib_core> failed : missing required namespace <com.mellanox.compat#9.2.3.0>

2017-03-29T21:24:30.109Z cpu3:66057)WARNING: Elf: 3017: Kernel based module load of ib_core failed: Invalid or missing namespace <ElfSetNamespaceInfo failed>

2017-03-29T21:24:30.721Z cpu3:66057)WARNING: Mod: 1690: <mlx_compat>: Export of <memmove>@<com.mellanox.compat> failed: already exported in name-space <vmkernel> by <vmkernel>

2017-03-29T21:24:30.721Z cpu3:66057)WARNING: Elf: 1908: Module <mlx_compat> - failed to finalize symbols

2017-03-29T21:24:30.721Z cpu3:66057)WARNING: Elf: 3017: Kernel based module load of mlx_compat failed: Already exists <ElfExportSymbols failed>

2017-03-29T21:24:31.512Z cpu3:66057)WARNING: Mod: 1690: <mlx_compat>: Export of <memmove>@<com.mellanox.compat> failed: already exported in name-space <vmkernel> by <vmkernel>

2017-03-29T21:24:31.512Z cpu3:66057)WARNING: Elf: 1908: Module <mlx_compat> - failed to finalize symbols

2017-03-29T21:24:31.512Z cpu3:66057)WARNING: Elf: 3017: Kernel based module load of mlx_compat failed: Already exists <ElfExportSymbols failed>

2017-03-29T21:24:32.308Z cpu3:66057)WARNING: Elf: 2219: Load of <ib_core> failed : missing required namespace <com.mellanox.compat#9.2.3.0>

2017-03-29T21:24:32.308Z cpu3:66057)WARNING: Elf: 3017: Kernel based module load of ib_core failed: Invalid or missing namespace <ElfSetNamespaceInfo failed>

2017-03-29T21:24:33.109Z cpu3:66057)WARNING: Elf: 2219: Load of <ib_mad> failed : missing required namespace <com.mellanox.compat#9.2.3.0>

2017-03-29T21:24:33.109Z cpu3:66057)WARNING: Elf: 3017: Kernel based module load of ib_mad failed: Invalid or missing namespace <ElfSetNamespaceInfo failed>

2017-03-29T21:24:33.712Z cpu3:66057)WARNING: Mod: 1690: <mlx_compat>: Export of <memmove>@<com.mellanox.compat> failed: already exported in name-space <vmkernel> by <vmkernel>

2017-03-29T21:24:33.712Z cpu3:66057)WARNING: Elf: 1908: Module <mlx_compat> - failed to finalize symbols

2017-03-29T21:24:33.712Z cpu3:66057)WARNING: Elf: 3017: Kernel based module load of mlx_compat failed: Already exists <ElfExportSymbols failed>

2017-03-29T21:24:34.508Z cpu3:66057)WARNING: Elf: 2219: Load of <ib_core> failed : missing required namespace <com.mellanox.compat#9.2.3.0>

2017-03-29T21:24:34.508Z cpu3:66057)WARNING: Elf: 3017: Kernel based module load of ib_core failed: Invalid or missing namespace <ElfSetNamespaceInfo failed>

2017-03-29T21:24:35.312Z cpu3:66057)WARNING: Mod: 1690: <mlx_compat>: Export of <memmove>@<com.mellanox.compat> failed: already exported in name-space <vmkernel> by <vmkernel>

2017-03-29T21:24:35.312Z cpu3:66057)WARNING: Elf: 1908: Module <mlx_compat> - failed to finalize symbols

2017-03-29T21:24:35.312Z cpu3:66057)WARNING: Elf: 3017: Kernel based module load of mlx_compat failed: Already exists <ElfExportSymbols failed>

2017-03-29T21:24:36.119Z cpu3:66057)WARNING: Elf: 2219: Load of <ib_core> failed : missing required namespace <com.mellanox.compat#9.2.3.0>

2017-03-29T21:24:36.119Z cpu3:66057)WARNING: Elf: 3017: Kernel based module load of ib_core failed: Invalid or missing namespace <ElfSetNamespaceInfo failed>

2017-03-29T21:24:36.712Z cpu3:66057)WARNING: Mod: 1690: <mlx_compat>: Export of <memmove>@<com.mellanox.compat> failed: already exported in name-space <vmkernel> by <vmkernel>

2017-03-29T21:24:36.712Z cpu3:66057)WARNING: Elf: 1908: Module <mlx_compat> - failed to finalize symbols

2017-03-29T21:24:36.712Z cpu3:66057)WARNING: Elf: 3017: Kernel based module load of mlx_compat failed: Already exists <ElfExportSymbols failed>

2017-03-29T21:24:37.519Z cpu3:66057)WARNING: Elf: 2219: Load of <ib_core> failed : missing required namespace <com.mellanox.compat#9.2.3.0>

2017-03-29T21:24:37.519Z cpu3:66057)WARNING: Elf: 3017: Kernel based module load of ib_core failed: Invalid or missing namespace <ElfSetNamespaceInfo failed>

2017-03-29T21:24:38.311Z cpu3:66057)WARNING: Mod: 1690: <mlx_compat>: Export of <memmove>@<com.mellanox.compat> failed: already exported in name-space <vmkernel> by <vmkernel>

2017-03-29T21:24:38.311Z cpu3:66057)WARNING: Elf: 1908: Module <mlx_compat> - failed to finalize symbols

2017-03-29T21:24:38.311Z cpu3:66057)WARNING: Elf: 3017: Kernel based module load of mlx_compat failed: Already exists <ElfExportSymbols failed>

2017-03-29T21:24:39.112Z cpu3:66057)WARNING: Mod: 1690: <mlx_compat>: Export of <memmove>@<com.mellanox.compat> failed: already exported in name-space <vmkernel> by <vmkernel>

2017-03-29T21:24:39.112Z cpu3:66057)WARNING: Elf: 1908: Module <mlx_compat> - failed to finalize symbols

2017-03-29T21:24:39.112Z cpu3:66057)WARNING: Elf: 3017: Kernel based module load of mlx_compat failed: Already exists <ElfExportSymbols failed>

2017-03-29T21:24:39.708Z cpu3:66057)WARNING: Elf: 2219: Load of <ib_core> failed : missing required namespace <com.mellanox.compat#9.2.3.0>

2017-03-29T21:24:39.708Z cpu3:66057)WARNING: Elf: 3017: Kernel based module load of ib_core failed: Invalid or missing namespace <ElfSetNamespaceInfo failed>

2017-03-29T21:24:40.509Z cpu3:66057)WARNING: Elf: 2219: Load of <ib_mad> failed : missing required namespace <com.mellanox.compat#9.2.3.0>

2017-03-29T21:24:40.509Z cpu3:66057)WARNING: Elf: 3017: Kernel based module load of ib_mad failed: Invalid or missing namespace <ElfSetNamespaceInfo failed>

2017-03-29T21:24:41.311Z cpu3:66057)WARNING: Mod: 1690: <mlx_compat>: Export of <memmove>@<com.mellanox.compat> failed: already exported in name-space <vmkernel> by <vmkernel>

2017-03-29T21:24:41.311Z cpu3:66057)WARNING: Elf: 1908: Module <mlx_compat> - failed to finalize symbols

2017-03-29T21:24:41.311Z cpu3:66057)WARNING: Elf: 3017: Kernel based module load of mlx_compat failed: Already exists <ElfExportSymbols failed>

2017-03-29T21:24:42.112Z cpu3:66057)WARNING: Mod: 1690: <mlx_compat>: Export of <memmove>@<com.mellanox.compat> failed: already exported in name-space <vmkernel> by <vmkernel>

2017-03-29T21:24:42.112Z cpu3:66057)WARNING: Elf: 1908: Module <mlx_compat> - failed to finalize symbols

2017-03-29T21:24:42.112Z cpu3:66057)WARNING: Elf: 3017: Kernel based module load of mlx_compat failed: Already exists <ElfExportSymbols failed>

2017-03-29T21:24:42.719Z cpu3:66057)WARNING: Elf: 2219: Load of <ib_core> failed : missing required namespace <com.mellanox.compat#9.2.3.0>

2017-03-29T21:24:42.719Z cpu3:66057)WARNING: Elf: 3017: Kernel based module load of ib_core failed: Invalid or missing namespace <ElfSetNamespaceInfo failed>

2017-03-29T21:24:43.512Z cpu3:66057)WARNING: Mod: 1690: <mlx_compat>: Export of <memmove>@<com.mellanox.compat> failed: already exported in name-space <vmkernel> by <vmkernel>

2017-03-29T21:24:43.512Z cpu3:66057)WARNING: Elf: 1908: Module <mlx_compat> - failed to finalize symbols

2017-03-29T21:24:43.512Z cpu3:66057)WARNING: Elf: 3017: Kernel based module load of mlx_compat failed: Already exists <ElfExportSymbols failed>

2017-03-29T21:24:44.309Z cpu7:66057)WARNING: Elf: 2219: Load of <ib_core> failed : missing required namespace <com.mellanox.compat#9.2.3.0>

2017-03-29T21:24:44.309Z cpu7:66057)WARNING: Elf: 3017: Kernel based module load of ib_core failed: Invalid or missing namespace <ElfSetNamespaceInfo failed>

2017-03-29T21:24:45.156Z cpu7:66057)WARNING: Mod: 1690: <mlx_compat>: Export of <memmove>@<com.mellanox.compat> failed: already exported in name-space <vmkernel> by <vmkernel>

2017-03-29T21:24:45.156Z cpu7:66057)WARNING: Elf: 1908: Module <mlx_compat> - failed to finalize symbols

2017-03-29T21:24:45.156Z cpu7:66057)WARNING: Elf: 3017: Kernel based module load of mlx_compat failed: Already exists <ElfExportSymbols failed>

2017-03-29T21:24:45.902Z cpu7:66057)WARNING: Mod: 1690: <mlx_compat>: Export of <memmove>@<com.mellanox.compat> failed: already exported in name-space <vmkernel> by <vmkernel>

2017-03-29T21:24:45.902Z cpu7:66057)WARNING: Elf: 1908: Module <mlx_compat> - failed to finalize symbols

2017-03-29T21:24:45.902Z cpu7:66057)WARNING: Elf: 3017: Kernel based module load of mlx_compat failed: Already exists <ElfExportSymbols failed>

2017-03-29T21:24:46.699Z cpu7:66057)WARNING: Elf: 2219: Load of <ib_core> failed : missing required namespace <com.mellanox.compat#9.2.3.0>

2017-03-29T21:24:46.699Z cpu7:66057)WARNING: Elf: 3017: Kernel based module load of ib_core failed: Invalid or missing namespace <ElfSetNamespaceInfo failed>

2017-03-29T21:24:47.385Z cpu7:66057)WARNING: Elf: 2219: Load of <ib_mad> failed : missing required namespace <com.mellanox.compat#9.2.3.0>

2017-03-29T21:24:47.385Z cpu7:66057)WARNING: Elf: 3017: Kernel based module load of ib_mad failed: Invalid or missing namespace <ElfSetNamespaceInfo failed>

2017-03-29T21:24:48.299Z cpu7:66057)WARNING: Elf: 2219: Load of <ib_sa> failed : missing required namespace <com.mellanox.compat#9.2.3.0>

2017-03-29T21:24:48.299Z cpu7:66057)WARNING: Elf: 3017: Kernel based module load of ib_sa failed: Invalid or missing namespace <ElfSetNamespaceInfo failed>

2017-03-29T21:24:48.901Z cpu7:66057)WARNING: Mod: 1690: <mlx_compat>: Export of <memmove>@<com.mellanox.compat> failed: already exported in name-space <vmkernel> by <vmkernel>

2017-03-29T21:24:48.901Z cpu7:66057)WARNING: Elf: 1908: Module <mlx_compat> - failed to finalize symbols

2017-03-29T21:24:48.901Z cpu7:66057)WARNING: Elf: 3017: Kernel based module load of mlx_compat failed: Already exists <ElfExportSymbols failed>

2017-03-29T21:24:49.703Z cpu7:66057)WARNING: Mod: 1690: <mlx_compat>: Export of <memmove>@<com.mellanox.compat> failed: already exported in name-space <vmkernel> by <vmkernel>

2017-03-29T21:24:49.703Z cpu7:66057)WARNING: Elf: 1908: Module <mlx_compat> - failed to finalize symbols

2017-03-29T21:24:49.703Z cpu7:66057)WARNING: Elf: 3017: Kernel based module load of mlx_compat failed: Already exists <ElfExportSymbols failed>

2017-03-29T21:24:50.390Z cpu7:66057)WARNING: Elf: 2219: Load of <ib_core> failed : missing required namespace <com.mellanox.compat#9.2.3.0>

2017-03-29T21:24:50.390Z cpu7:66057)WARNING: Elf: 3017: Kernel based module load of ib_core failed: Invalid or missing namespace <ElfSetNamespaceInfo failed>

2017-03-29T21:24:51.301Z cpu7:66057)WARNING: Mod: 1690: <mlx_compat>: Export of <memmove>@<com.mellanox.compat> failed: already exported in name-space <vmkernel> by <vmkernel>

2017-03-29T21:24:51.301Z cpu7:66057)WARNING: Elf: 1908: Module <mlx_compat> - failed to finalize symbols

2017-03-29T21:24:51.301Z cpu7:66057)WARNING: Elf: 3017: Kernel based module load of mlx_compat failed: Already exists <ElfExportSymbols failed>

2017-03-29T21:24:52.099Z cpu7:66057)WARNING: Elf: 2219: Load of <ib_core> failed : missing required namespace <com.mellanox.compat#9.2.3.0>

2017-03-29T21:24:52.099Z cpu7:66057)WARNING: Elf: 3017: Kernel based module load of ib_core failed: Invalid or missing namespace <ElfSetNamespaceInfo failed>

2017-03-29T21:24:52.701Z cpu7:66057)WARNING: Mod: 1690: <mlx_compat>: Export of <memmove>@<com.mellanox.compat> failed: already exported in name-space <vmkernel> by <vmkernel>

2017-03-29T21:24:52.701Z cpu7:66057)WARNING: Elf: 1908: Module <mlx_compat> - failed to finalize symbols

2017-03-29T21:24:52.701Z cpu7:66057)WARNING: Elf: 3017: Kernel based module load of mlx_compat failed: Already exists <ElfExportSymbols failed>

2017-03-29T21:24:53.502Z cpu7:66057)WARNING: Mod: 1690: <mlx_compat>: Export of <memmove>@<com.mellanox.compat> failed: already exported in name-space <vmkernel> by <vmkernel>

2017-03-29T21:24:53.502Z cpu7:66057)WARNING: Elf: 1908: Module <mlx_compat> - failed to finalize symbols

2017-03-29T21:24:53.502Z cpu7:66057)WARNING: Elf: 3017: Kernel based module load of mlx_compat failed: Already exists <ElfExportSymbols failed>

2017-03-29T21:24:54.299Z cpu7:66057)WARNING: Elf: 2219: Load of <ib_core> failed : missing required namespace <com.mellanox.compat#9.2.3.0>

2017-03-29T21:24:54.299Z cpu7:66057)WARNING: Elf: 3017: Kernel based module load of ib_core failed: Invalid or missing namespace <ElfSetNamespaceInfo failed>

2017-03-29T21:24:54.899Z cpu7:66057)WARNING: Elf: 2219: Load of <ib_mad> failed : missing required namespace <com.mellanox.compat#9.2.3.0>

2017-03-29T21:24:54.899Z cpu7:66057)WARNING: Elf: 3017: Kernel based module load of ib_mad failed: Invalid or missing namespace <ElfSetNamespaceInfo failed>

2017-03-29T21:24:55.698Z cpu7:66057)WARNING: Mod: 1690: <mlx_compat>: Export of <memmove>@<com.mellanox.compat> failed: already exported in name-space <vmkernel> by <vmkernel>

2017-03-29T21:24:55.698Z cpu7:66057)WARNING: Elf: 1908: Module <mlx_compat> - failed to finalize symbols

2017-03-29T21:24:55.698Z cpu7:66057)WARNING: Elf: 3017: Kernel based module load of mlx_compat failed: Already exists <ElfExportSymbols failed>

2017-03-29T21:24:56.403Z cpu7:66057)WARNING: Elf: 2219: Load of <ib_core> failed : missing required namespace <com.mellanox.compat#9.2.3.0>

2017-03-29T21:24:56.403Z cpu7:66057)WARNING: Elf: 3017: Kernel based module load of ib_core failed: Invalid or missing namespace <ElfSetNamespaceInfo failed>

2017-03-29T21:24:57.301Z cpu7:66057)WARNING: Mod: 1690: <mlx_compat>: Export of <memmove>@<com.mellanox.compat> failed: already exported in name-space <vmkernel> by <vmkernel>

2017-03-29T21:24:57.301Z cpu7:66057)WARNING: Elf: 1908: Module <mlx_compat> - failed to finalize symbols

2017-03-29T21:24:57.301Z cpu7:66057)WARNING: Elf: 3017: Kernel based module load of mlx_compat failed: Already exists <ElfExportSymbols failed>

2017-03-29T21:24:57.751Z cpu7:66057)WARNING: Elf: 2219: Load of <ib_core> failed : missing required namespace <com.mellanox.compat#9.2.3.0>

2017-03-29T21:24:57.751Z cpu7:66057)WARNING: Elf: 3017: Kernel based module load of ib_core failed: Invalid or missing namespace <ElfSetNamespaceInfo failed>

2017-03-29T21:24:58.606Z cpu7:66057)WARNING: Mod: 1690: <mlx_compat>: Export of <memmove>@<com.mellanox.compat> failed: already exported in name-space <vmkernel> by <vmkernel>

2017-03-29T21:24:58.606Z cpu7:66057)WARNING: Elf: 1908: Module <mlx_compat> - failed to finalize symbols

2017-03-29T21:24:58.606Z cpu7:66057)WARNING: Elf: 3017: Kernel based module load of mlx_compat failed: Already exists <ElfExportSymbols failed>

2017-03-29T21:24:59.699Z cpu7:66057)WARNING: Elf: 2219: Load of <ib_core> failed : missing required namespace <com.mellanox.compat#9.2.3.0>

2017-03-29T21:24:59.699Z cpu7:66057)WARNING: Elf: 3017: Kernel based module load of ib_core failed: Invalid or missing namespace <ElfSetNamespaceInfo failed>

2017-03-29T21:25:00.300Z cpu7:66057)WARNING: Mod: 1690: <mlx_compat>: Export of <memmove>@<com.mellanox.compat> failed: already exported in name-space <vmkernel> by <vmkernel>

2017-03-29T21:25:00.300Z cpu7:66057)WARNING: Elf: 1908: Module <mlx_compat> - failed to finalize symbols

2017-03-29T21:25:00.300Z cpu7:66057)WARNING: Elf: 3017: Kernel based module load of mlx_compat failed: Already exists <ElfExportSymbols failed>

2017-03-29T21:25:01.214Z cpu7:66057)WARNING: Mod: 1690: <mlx_compat>: Export of <memmove>@<com.mellanox.compat> failed: already exported in name-space <vmkernel> by <vmkernel>

2017-03-29T21:25:01.214Z cpu7:66057)WARNING: Elf: 1908: Module <mlx_compat> - failed to finalize symbols

2017-03-29T21:25:01.214Z cpu7:66057)WARNING: Elf: 3017: Kernel based module load of mlx_compat failed: Already exists <ElfExportSymbols failed>

2017-03-29T21:25:01.551Z cpu7:66057)WARNING: Elf: 2219: Load of <ib_core> failed : missing required namespace <com.mellanox.compat#9.2.3.0>

2017-03-29T21:25:01.551Z cpu7:66057)WARNING: Elf: 3017: Kernel based module load of ib_core failed: Invalid or missing namespace <ElfSetNamespaceInfo failed>

2017-03-29T21:25:02.409Z cpu7:66057)WARNING: Elf: 2219: Load of <ib_mad> failed : missing required namespace <com.mellanox.compat#9.2.3.0>

2017-03-29T21:25:02.409Z cpu7:66057)WARNING: Elf: 3017: Kernel based module load of ib_mad failed: Invalid or missing namespace <ElfSetNamespaceInfo failed>

2017-03-29T21:25:03.155Z cpu7:66057)WARNING: Mod: 1690: <mlx_compat>: Export of <memmove>@<com.mellanox.compat> failed: already exported in name-space <vmkernel> by <vmkernel>

2017-03-29T21:25:03.155Z cpu7:66057)WARNING: Elf: 1908: Module <mlx_compat> - failed to finalize symbols

2017-03-29T21:25:03.155Z cpu7:66057)WARNING: Elf: 3017: Kernel based module load of mlx_compat failed: Already exists <ElfExportSymbols failed>

2017-03-29T21:25:04.102Z cpu7:66057)WARNING: Mod: 1690: <mlx_compat>: Export of <memmove>@<com.mellanox.compat> failed: already exported in name-space <vmkernel> by <vmkernel>

2017-03-29T21:25:04.102Z cpu7:66057)WARNING: Elf: 1908: Module <mlx_compat> - failed to finalize symbols

2017-03-29T21:25:04.102Z cpu7:66057)WARNING: Elf: 3017: Kernel based module load of mlx_compat failed: Already exists <ElfExportSymbols failed>

2017-03-29T21:25:04.551Z cpu7:66057)WARNING: Elf: 2219: Load of <ib_core> failed : missing required namespace <com.mellanox.compat#9.2.3.0>

2017-03-29T21:25:04.551Z cpu7:66057)WARNING: Elf: 3017: Kernel based module load of ib_core failed: Invalid or missing namespace <ElfSetNamespaceInfo failed>

2017-03-29T21:25:05.702Z cpu7:66057)WARNING: Mod: 1690: <mlx_compat>: Export of <memmove>@<com.mellanox.compat> failed: already exported in name-space <vmkernel> by <vmkernel>

2017-03-29T21:25:05.702Z cpu7:66057)WARNING: Elf: 1908: Module <mlx_compat> - failed to finalize symbols

2017-03-29T21:25:05.702Z cpu7:66057)WARNING: Elf: 3017: Kernel based module load of mlx_compat failed: Already exists <ElfExportSymbols failed>

2017-03-29T21:25:06.299Z cpu7:66057)WARNING: Elf: 2219: Load of <ib_core> failed : missing required namespace <com.mellanox.compat#9.2.3.0>

2017-03-29T21:25:06.299Z cpu7:66057)WARNING: Elf: 3017: Kernel based module load of ib_core failed: Invalid or missing namespace <ElfSetNamespaceInfo failed>

2017-03-29T21:25:07.051Z cpu7:66057)WARNING: Mod: 1690: <mlx_compat>: Export of <memmove>@<com.mellanox.compat> failed: already exported in name-space <vmkernel> by <vmkernel>

2017-03-29T21:25:07.051Z cpu7:66057)WARNING: Elf: 1908: Module <mlx_compat> - failed to finalize symbols

2017-03-29T21:25:07.051Z cpu7:66057)WARNING: Elf: 3017: Kernel based module load of mlx_compat failed: Already exists <ElfExportSymbols failed>

2017-03-29T21:25:07.702Z cpu7:66057)WARNING: Mod: 1690: <mlx_compat>: Export of <memmove>@<com.mellanox.compat> failed: already exported in name-space <vmkernel> by <vmkernel>

2017-03-29T21:25:07.702Z cpu7:66057)WARNING: Elf: 1908: Module <mlx_compat> - failed to finalize symbols

2017-03-29T21:25:07.702Z cpu7:66057)WARNING: Elf: 3017: Kernel based module load of mlx_compat failed: Already exists <ElfExportSymbols failed>

2017-03-29T21:25:08.499Z cpu7:66057)WARNING: Elf: 2219: Load of <ib_core> failed : missing required namespace <com.mellanox.compat#9.2.3.0>

2017-03-29T21:25:08.499Z cpu7:66057)WARNING: Elf: 3017: Kernel based module load of ib_core failed: Invalid or missing namespace <ElfSetNamespaceInfo failed>

2017-03-29T21:25:09.298Z cpu7:66057)WARNING: Elf: 2219: Load of <ib_mad> failed : missing required namespace <com.mellanox.compat#9.2.3.0>

2017-03-29T21:25:09.298Z cpu7:66057)WARNING: Elf: 3017: Kernel based module load of ib_mad failed: Invalid or missing namespace <ElfSetNamespaceInfo failed>

2017-03-29T21:25:09.899Z cpu7:66057)WARNING: Elf: 2219: Load of <ib_sa> failed : missing required namespace <com.mellanox.compat#9.2.3.0>

2017-03-29T21:25:09.899Z cpu7:66057)WARNING: Elf: 3017: Kernel based module load of ib_sa failed: Invalid or missing namespace <ElfSetNamespaceInfo failed>

2017-03-29T21:25:10.699Z cpu7:66057)WARNING: Elf: 2219: Load of <ib_ipoib> failed : missing required namespace <com.mellanox.compat#9.2.3.0>

2017-03-29T21:25:10.699Z cpu7:66057)WARNING: Elf: 3017: Kernel based module load of ib_ipoib failed: Invalid or missing namespace <ElfSetNamespaceInfo failed>

2017-03-29T21:25:11.464Z cpu1:65887)Jumpstart plugin mlnx_ofed activation failed: mlnx_ofed->start() failed: error while executing the cli

2017-03-29T21:25:11.630Z cpu2:65594)ScsiNpiv: 1518: GetInfo for adapter vmhba0, [0x43029e358280], max_vports=0, vports_inuse=0, linktype=0, state=0, failreason=0, sts=bad0020

2017-03-29T21:25:15.739Z cpu6:65869)ScsiDeviceIO: 9167: Get VPD 86 Inquiry for device "t10.ATA_____INTEL_SSDSC2BB480G6_____________________PHWA6343029Y480FGN__" from Plugin "NMP" failed. Not supported

2017-03-29T21:25:15.740Z cpu6:65869)ScsiDeviceIO: 9167: Get VPD 86 Inquiry for device "t10.ATA_____INTEL_SSDSC2BB480G6_____________________PHWA634302AU480FGN__" from Plugin "NMP" failed. Not supported

2017-03-29T21:25:21.465Z cpu0:65887)Jumpstart plugin dump-file activation failed: dump-file->start() failed: error while executing the cli

2017-03-29T21:25:21.466Z cpu0:65887)Jumpstart plugin vmci activation failed: vmci->start() failed: error while executing the cli

2017-03-29T21:25:23.202Z cpu0:65887)Jumpstart plugin vmswapcleanup activation failed: vmswapcleanup->start() failed: error while executing the cli

2017-03-29T21:25:39.807Z cpu1:67823)FSDisk: 300: Issue of delete blocks failed [sync:0] numDescs 1 Address is not aligned on required boundary 0x439500a43300

2017-03-29T21:27:34.268Z cpu4:66086)NMP: nmp_ThrottleLogForDevice:3617: Cmd 0x2a (0x439500a68280, 67832) to dev "t10.ATA_____INTEL_SSDSC2BB480G6_____________________PHWA6343029Y480FGN__" on path "vmhba0:C0:T0:L0" Failed: H:0x2 D:0x0 P:0x0 Invalid sense $

2017-03-29T21:27:34.268Z cpu4:66086)ScsiDeviceIO: 2927: Cmd(0x439500a68280) 0x2a, CmdSN 0x9f from world 67832 to dev "t10.ATA_____INTEL_SSDSC2BB480G6_____________________PHWA6343029Y480FGN__" failed H:0x2 D:0x0 P:0x0 Invalid sense data: 0x75 0x70 0x64.

2017-03-29T21:27:35.268Z cpu4:66086)ScsiDeviceIO: 2927: Cmd(0x439500afdc80) 0x28, CmdSN 0xea from world 67832 to dev "t10.ATA_____INTEL_SSDSC2BB480G6_____________________PHWA6343029Y480FGN__" failed H:0x2 D:0x0 P:0x0 Invalid sense data: 0xff 0xff 0xff.

2017-03-29T21:27:35.283Z cpu4:65565)ScsiDeviceIO: 2927: Cmd(0x439500a70b00) 0x2a, CmdSN 0xa68 from world 65551 to dev "t10.ATA_____INTEL_SSDSC2BB480G6_____________________PHWA6343029Y480FGN__" failed H:0x2 D:0x0 P:0x0 Invalid sense data: 0x0 0x0 0x0.

2017-03-29T21:27:39.768Z cpu0:68543)FSDisk: 300: Issue of delete blocks failed [sync:0] numDescs 1 Address is not aligned on required boundary 0x439500b43c80

[root@esx01:~] dmesg |grep -i error

VMB: 52: intelTXTErrorCode = 0x0

TSC: 445750 cpu0:1)BootConfig: 487: enablePCIErrors = FALSE

TSC: 521116 cpu0:1)BootConfig: 603: intelTXTErrorCode = 0 (0)

0:00:00:04.715 cpu0:65536)PCI: 204: enablePCIErrors: 0, enableValidPCIDevices: 1, pciSetBusMaster: 1, disableACSCheck: 0, disableACSCheckForRP: 1, enablePCIEHotplug: 1, pciBarAllocPolicy: 0

0:00:00:04.721 cpu0:65536)PCI: 235: 0000:00:1d.0: Found support for extended capability 0x1 (Advanced Error Reporting)

0:00:00:04.721 cpu0:65536)PCI: 235: 0000:00:1d.2: Found support for extended capability 0x1 (Advanced Error Reporting)

0:00:00:04.722 cpu0:65536)PCI: 235: 0000:00:1d.3: Found support for extended capability 0x1 (Advanced Error Reporting)

0:00:00:04.723 cpu0:65536)PCI: 235: 0000:02:00.0: Found support for extended capability 0x1 (Advanced Error Reporting)

0:00:00:04.723 cpu0:65536)PCI: 235: 0000:03:00.0: Found support for extended capability 0x1 (Advanced Error Reporting)

2017-03-29T21:22:39.160Z cpu0:65887)Jumpstart plugin iodm activation failed: iodm->start() failed: error while executing the cli

2017-03-29T21:25:11.464Z cpu1:65887)Jumpstart plugin mlnx_ofed activation failed: mlnx_ofed->start() failed: error while executing the cli

2017-03-29T21:25:15.739Z cpu6:65869)ScsiDeviceIO: 8365: Could not detect setting of sitpua for device t10.ATA_____INTEL_SSDSC2BB480G6_____________________PHWA6343029Y480FGN__. Error Not supported.

2017-03-29T21:25:15.740Z cpu6:65869)ScsiDeviceIO: 8365: Could not detect setting of sitpua for device t10.ATA_____INTEL_SSDSC2BB480G6_____________________PHWA634302AU480FGN__. Error Not supported.

2017-03-29T21:25:21.465Z cpu0:65887)Jumpstart plugin dump-file activation failed: dump-file->start() failed: error while executing the cli

2017-03-29T21:25:21.466Z cpu0:65887)Jumpstart plugin vmci activation failed: vmci->start() failed: error while executing the cli

2017-03-29T21:25:23.202Z cpu0:65887)Jumpstart plugin vmswapcleanup activation failed: vmswapcleanup->start() failed: error while executing the cli

2017-03-29T21:27:34.786Z cpu4:66086)NMP: nmp_ThrottleLogForDevice:3546: last error status from device t10.ATA_____INTEL_SSDSC2BB480G6_____________________PHWA6343029Y480FGN__ repeated 10 times

2017-03-29T21:27:35.255Z cpu4:66086)NMP: nmp_ThrottleLogForDevice:3546: last error status from device t10.ATA_____INTEL_SSDSC2BB480G6_____________________PHWA6343029Y480FGN__ repeated 20 times

2017-03-29T21:27:35.922Z cpu4:66086)NMP: nmp_ThrottleLogForDevice:3546: last error status from device t10.ATA_____INTEL_SSDSC2BB480G6_____________________PHWA6343029Y480FGN__ repeated 40 times

2017-03-29T21:27:39.768Z cpu3:66086)NMP: nmp_ThrottleLogForDevice:3563: last error status from device t10.ATA_____INTEL_SSDSC2BB480G6_____________________PHWA6343029Y480FGN__ repeated 32 times

Best Regards

TaKeN

0 Kudos
0 Replies